This file contains any messages produced by compilers while
running configure, to aid debugging if configure makes a mistake.

It was created by configure, which was
generated by GNU Autoconf 2.71.  Invocation command line was

  $ ./configure --disable-option-checking --prefix=/usr --without-gui --cache-file=/dev/null --srcdir=.

## --------- ##
## Platform. ##
## --------- ##

hostname = pine64so
uname -m = aarch64
uname -r = 5.4.2-rt5-001
uname -s = Linux
uname -v = #108 SMP PREEMPT_RT Wed Oct 11 12:20:26 AEDT 2023

/usr/bin/uname -p = unknown
/bin/uname -X     = unknown

/bin/arch              = aarch64
/usr/bin/arch -k       = unknown
/usr/convex/getsysinfo = unknown
/usr/bin/hostinfo      = unknown
/bin/machine           = unknown
/usr/bin/oslevel       = unknown
/bin/universe          = unknown

PATH: /usr/local/bin/
PATH: /usr/bin/
PATH: /bin/
PATH: /usr/local/games/
PATH: /usr/games/


## ----------- ##
## Core tests. ##
## ----------- ##

configure:2758: looking for aux files: compile missing install-sh config.guess config.sub
configure:2771:  trying ././
configure:2800:   ././compile found
configure:2800:   ././missing found
configure:2782:   ././install-sh found
configure:2800:   ././config.guess found
configure:2800:   ././config.sub found
configure:2920: checking build system type
configure:2935: result: aarch64-unknown-linux-gnu
configure:2955: checking host system type
configure:2969: result: aarch64-unknown-linux-gnu
configure:2989: checking target system type
configure:3003: result: aarch64-unknown-linux-gnu
configure:3063: checking for a BSD-compatible install
configure:3136: result: /usr/bin/install -c
configure:3147: checking whether build environment is sane
configure:3202: result: yes
configure:3361: checking for a race-free mkdir -p
configure:3405: result: /usr/bin/mkdir -p
configure:3412: checking for gawk
configure:3447: result: no
configure:3412: checking for mawk
configure:3433: found /usr/bin/mawk
configure:3444: result: mawk
configure:3455: checking whether make sets $(MAKE)
configure:3478: result: yes
configure:3508: checking whether make supports nested variables
configure:3526: result: yes
configure:3729: checking for gcc
configure:3750: found /usr/bin/gcc
configure:3761: result: gcc
configure:4114: checking for C compiler version
configure:4123: gcc --version >&5
gcc (Debian 12.2.0-14) 12.2.0
Copyright (C) 2022 Free Software Foundation, Inc.
This is free software; see the source for copying conditions.  There is NO
warranty; not even for MERCHANTABILITY or FITNESS FOR A PARTICULAR PURPOSE.

configure:4134: $? = 0
configure:4123: gcc -v >&5
Using built-in specs.
COLLECT_GCC=gcc
COLLECT_LTO_WRAPPER=/usr/lib/gcc/aarch64-linux-gnu/12/lto-wrapper
Target: aarch64-linux-gnu
Configured with: ../src/configure -v --with-pkgversion='Debian 12.2.0-14' --with-bugurl=file:///usr/share/doc/gcc-12/README.Bugs --enable-languages=c,ada,c++,go,d,fortran,objc,obj-c++,m2 --prefix=/usr --with-gcc-major-version-only --program-suffix=-12 --program-prefix=aarch64-linux-gnu- --enable-shared --enable-linker-build-id --libexecdir=/usr/lib --without-included-gettext --enable-threads=posix --libdir=/usr/lib --enable-nls --enable-clocale=gnu --enable-libstdcxx-debug --enable-libstdcxx-time=yes --with-default-libstdcxx-abi=new --enable-gnu-unique-object --disable-libquadmath --disable-libquadmath-support --enable-plugin --enable-default-pie --with-system-zlib --enable-libphobos-checking=release --with-target-system-zlib=auto --enable-objc-gc=auto --enable-multiarch --enable-fix-cortex-a53-843419 --disable-werror --enable-checking=release --build=aarch64-linux-gnu --host=aarch64-linux-gnu --target=aarch64-linux-gnu
Thread model: posix
Supported LTO compression algorithms: zlib zstd
gcc version 12.2.0 (Debian 12.2.0-14) 
configure:4134: $? = 0
configure:4123: gcc -V >&5
gcc: error: unrecognized command-line option '-V'
gcc: fatal error: no input files
compilation terminated.
configure:4134: $? = 1
configure:4123: gcc -qversion >&5
gcc: error: unrecognized command-line option '-qversion'; did you mean '--version'?
gcc: fatal error: no input files
compilation terminated.
configure:4134: $? = 1
configure:4123: gcc -version >&5
gcc: error: unrecognized command-line option '-version'
gcc: fatal error: no input files
compilation terminated.
configure:4134: $? = 1
configure:4154: checking whether the C compiler works
configure:4176: gcc    conftest.c  >&5
configure:4180: $? = 0
configure:4230: result: yes
configure:4233: checking for C compiler default output file name
configure:4235: result: a.out
configure:4241: checking for suffix of executables
configure:4248: gcc -o conftest    conftest.c  >&5
configure:4252: $? = 0
configure:4275: result: 
configure:4297: checking whether we are cross compiling
configure:4305: gcc -o conftest    conftest.c  >&5
configure:4309: $? = 0
configure:4316: ./conftest
configure:4320: $? = 0
configure:4335: result: no
configure:4340: checking for suffix of object files
configure:4363: gcc -c   conftest.c >&5
configure:4367: $? = 0
configure:4389: result: o
configure:4393: checking whether the compiler supports GNU C
configure:4413: gcc -c   conftest.c >&5
configure:4413: $? = 0
configure:4423: result: yes
configure:4434: checking whether gcc accepts -g
configure:4455: gcc -c -g  conftest.c >&5
configure:4455: $? = 0
configure:4499: result: yes
configure:4519: checking for gcc option to enable C11 features
configure:4534: gcc  -c -g -O2  conftest.c >&5
configure:4534: $? = 0
configure:4552: result: none needed
configure:4668: checking whether gcc understands -c and -o together
configure:4691: gcc -c conftest.c -o conftest2.o
configure:4694: $? = 0
configure:4691: gcc -c conftest.c -o conftest2.o
configure:4694: $? = 0
configure:4706: result: yes
configure:4726: checking whether make supports the include directive
configure:4741: make -f confmf.GNU && cat confinc.out
this is the am__doit target
configure:4744: $? = 0
configure:4763: result: yes (GNU style)
configure:4789: checking dependency style of gcc
configure:4901: result: gcc3
configure:4985: checking for g++
configure:5006: found /usr/bin/g++
configure:5017: result: g++
configure:5044: checking for C++ compiler version
configure:5053: g++ --version >&5
g++ (Debian 12.2.0-14) 12.2.0
Copyright (C) 2022 Free Software Foundation, Inc.
This is free software; see the source for copying conditions.  There is NO
warranty; not even for MERCHANTABILITY or FITNESS FOR A PARTICULAR PURPOSE.

configure:5064: $? = 0
configure:5053: g++ -v >&5
Using built-in specs.
COLLECT_GCC=g++
COLLECT_LTO_WRAPPER=/usr/lib/gcc/aarch64-linux-gnu/12/lto-wrapper
Target: aarch64-linux-gnu
Configured with: ../src/configure -v --with-pkgversion='Debian 12.2.0-14' --with-bugurl=file:///usr/share/doc/gcc-12/README.Bugs --enable-languages=c,ada,c++,go,d,fortran,objc,obj-c++,m2 --prefix=/usr --with-gcc-major-version-only --program-suffix=-12 --program-prefix=aarch64-linux-gnu- --enable-shared --enable-linker-build-id --libexecdir=/usr/lib --without-included-gettext --enable-threads=posix --libdir=/usr/lib --enable-nls --enable-clocale=gnu --enable-libstdcxx-debug --enable-libstdcxx-time=yes --with-default-libstdcxx-abi=new --enable-gnu-unique-object --disable-libquadmath --disable-libquadmath-support --enable-plugin --enable-default-pie --with-system-zlib --enable-libphobos-checking=release --with-target-system-zlib=auto --enable-objc-gc=auto --enable-multiarch --enable-fix-cortex-a53-843419 --disable-werror --enable-checking=release --build=aarch64-linux-gnu --host=aarch64-linux-gnu --target=aarch64-linux-gnu
Thread model: posix
Supported LTO compression algorithms: zlib zstd
gcc version 12.2.0 (Debian 12.2.0-14) 
configure:5064: $? = 0
configure:5053: g++ -V >&5
g++: error: unrecognized command-line option '-V'
g++: fatal error: no input files
compilation terminated.
configure:5064: $? = 1
configure:5053: g++ -qversion >&5
g++: error: unrecognized command-line option '-qversion'; did you mean '--version'?
g++: fatal error: no input files
compilation terminated.
configure:5064: $? = 1
configure:5068: checking whether the compiler supports GNU C++
configure:5088: g++ -c   conftest.cpp >&5
configure:5088: $? = 0
configure:5098: result: yes
configure:5109: checking whether g++ accepts -g
configure:5130: g++ -c -g  conftest.cpp >&5
configure:5130: $? = 0
configure:5174: result: yes
configure:5194: checking for g++ option to enable C++11 features
configure:5209: g++  -c -g -O2  conftest.cpp >&5
conftest.cpp: In function 'int main(int, char**)':
conftest.cpp:177:25: warning: empty parentheses were disambiguated as a function declaration [-Wvexing-parse]
  177 |   cxx11test::delegate d2();
      |                         ^~
conftest.cpp:177:25: note: remove parentheses to default-initialize a variable
  177 |   cxx11test::delegate d2();
      |                         ^~
      |                         --
conftest.cpp:177:25: note: or replace parentheses with braces to value-initialize a variable
configure:5209: $? = 0
configure:5227: result: none needed
configure:5293: checking dependency style of g++
configure:5405: result: gcc3
configure:5570: checking for ranlib
configure:5591: found /usr/bin/ranlib
configure:5602: result: ranlib
configure:5647: checking whether g++ supports C++11 features with -std=c++11
configure:5946: g++ -std=c++11 -c  -pipe -Wall -D_LARGEFILE_SOURCE -D_LARGEFILE64_SOURCE  conftest.cpp >&5
configure:5946: $? = 0
configure:5956: result: yes
configure:5996: checking for --with-macosx-sdk
configure:6020: result: 
configure:6023: checking for --with-macosx-version-min
configure:6048: result: yes
configure:6201: checking for dirent.h that defines DIR
configure:6221: g++ -std=c++11 -c  -pipe -Wall -D_LARGEFILE_SOURCE -D_LARGEFILE64_SOURCE  conftest.cpp >&5
configure:6221: $? = 0
configure:6230: result: yes
configure:6244: checking for library containing opendir
configure:6273: g++ -std=c++11 -o conftest  -pipe -Wall -D_LARGEFILE_SOURCE -D_LARGEFILE64_SOURCE   conftest.cpp  >&5
configure:6273: $? = 0
configure:6293: result: none required
configure:6367: checking for stdio.h
configure:6367: g++ -std=c++11 -c  -pipe -Wall -D_LARGEFILE_SOURCE -D_LARGEFILE64_SOURCE  conftest.cpp >&5
configure:6367: $? = 0
configure:6367: result: yes
configure:6367: checking for stdlib.h
configure:6367: g++ -std=c++11 -c  -pipe -Wall -D_LARGEFILE_SOURCE -D_LARGEFILE64_SOURCE  conftest.cpp >&5
configure:6367: $? = 0
configure:6367: result: yes
configure:6367: checking for string.h
configure:6367: g++ -std=c++11 -c  -pipe -Wall -D_LARGEFILE_SOURCE -D_LARGEFILE64_SOURCE  conftest.cpp >&5
configure:6367: $? = 0
configure:6367: result: yes
configure:6367: checking for inttypes.h
configure:6367: g++ -std=c++11 -c  -pipe -Wall -D_LARGEFILE_SOURCE -D_LARGEFILE64_SOURCE  conftest.cpp >&5
configure:6367: $? = 0
configure:6367: result: yes
configure:6367: checking for stdint.h
configure:6367: g++ -std=c++11 -c  -pipe -Wall -D_LARGEFILE_SOURCE -D_LARGEFILE64_SOURCE  conftest.cpp >&5
configure:6367: $? = 0
configure:6367: result: yes
configure:6367: checking for strings.h
configure:6367: g++ -std=c++11 -c  -pipe -Wall -D_LARGEFILE_SOURCE -D_LARGEFILE64_SOURCE  conftest.cpp >&5
configure:6367: $? = 0
configure:6367: result: yes
configure:6367: checking for sys/stat.h
configure:6367: g++ -std=c++11 -c  -pipe -Wall -D_LARGEFILE_SOURCE -D_LARGEFILE64_SOURCE  conftest.cpp >&5
configure:6367: $? = 0
configure:6367: result: yes
configure:6367: checking for sys/types.h
configure:6367: g++ -std=c++11 -c  -pipe -Wall -D_LARGEFILE_SOURCE -D_LARGEFILE64_SOURCE  conftest.cpp >&5
configure:6367: $? = 0
configure:6367: result: yes
configure:6367: checking for unistd.h
configure:6367: g++ -std=c++11 -c  -pipe -Wall -D_LARGEFILE_SOURCE -D_LARGEFILE64_SOURCE  conftest.cpp >&5
configure:6367: $? = 0
configure:6367: result: yes
configure:6367: checking for sys/time.h
configure:6367: g++ -std=c++11 -c  -pipe -Wall -D_LARGEFILE_SOURCE -D_LARGEFILE64_SOURCE  conftest.cpp >&5
configure:6367: $? = 0
configure:6367: result: yes
configure:6392: checking for grep that handles long lines and -e
configure:6456: result: /usr/bin/grep
configure:6464: checking for egrep
configure:6532: result: /usr/bin/grep -E
configure:6538: checking for fcntl.h
configure:6538: g++ -std=c++11 -c  -pipe -Wall -D_LARGEFILE_SOURCE -D_LARGEFILE64_SOURCE  conftest.cpp >&5
configure:6538: $? = 0
configure:6538: result: yes
configure:6544: checking for limits.h
configure:6544: g++ -std=c++11 -c  -pipe -Wall -D_LARGEFILE_SOURCE -D_LARGEFILE64_SOURCE  conftest.cpp >&5
configure:6544: $? = 0
configure:6544: result: yes
configure:6550: checking for sys/time.h
configure:6550: result: yes
configure:6556: checking for unistd.h
configure:6556: result: yes
configure:6564: checking for off_t
configure:6564: g++ -std=c++11 -c  -pipe -Wall -D_LARGEFILE_SOURCE -D_LARGEFILE64_SOURCE  conftest.cpp >&5
configure:6564: $? = 0
configure:6564: g++ -std=c++11 -c  -pipe -Wall -D_LARGEFILE_SOURCE -D_LARGEFILE64_SOURCE  conftest.cpp >&5
conftest.cpp: In function 'int main()':
conftest.cpp:59:19: error: expected primary-expression before ')' token
   59 | if (sizeof ((off_t)))
      |                   ^
configure:6564: $? = 1
configure: failed program was:
| /* confdefs.h */
| #define PACKAGE_NAME ""
| #define PACKAGE_TARNAME ""
| #define PACKAGE_VERSION ""
| #define PACKAGE_STRING ""
| #define PACKAGE_BUGREPORT ""
| #define PACKAGE_URL ""
| #define PACKAGE "libpbd"
| #define VERSION "2.6.0"
| #define HAVE_CXX11 1
| #define HAVE_DIRENT_H 1
| #define HAVE_STDIO_H 1
| #define HAVE_STDLIB_H 1
| #define HAVE_STRING_H 1
| #define HAVE_INTTYPES_H 1
| #define HAVE_STDINT_H 1
| #define HAVE_STRINGS_H 1
| #define HAVE_SYS_STAT_H 1
| #define HAVE_SYS_TYPES_H 1
| #define HAVE_UNISTD_H 1
| #define HAVE_SYS_TIME_H 1
| #define STDC_HEADERS 1
| #define HAVE_FCNTL_H 1
| #define HAVE_LIMITS_H 1
| #define HAVE_SYS_TIME_H 1
| #define HAVE_UNISTD_H 1
| /* end confdefs.h.  */
| #include <stddef.h>
| #ifdef HAVE_STDIO_H
| # include <stdio.h>
| #endif
| #ifdef HAVE_STDLIB_H
| # include <stdlib.h>
| #endif
| #ifdef HAVE_STRING_H
| # include <string.h>
| #endif
| #ifdef HAVE_INTTYPES_H
| # include <inttypes.h>
| #endif
| #ifdef HAVE_STDINT_H
| # include <stdint.h>
| #endif
| #ifdef HAVE_STRINGS_H
| # include <strings.h>
| #endif
| #ifdef HAVE_SYS_TYPES_H
| # include <sys/types.h>
| #endif
| #ifdef HAVE_SYS_STAT_H
| # include <sys/stat.h>
| #endif
| #ifdef HAVE_UNISTD_H
| # include <unistd.h>
| #endif
| int
| main (void)
| {
| if (sizeof ((off_t)))
| 	    return 0;
|   ;
|   return 0;
| }
configure:6564: result: yes
configure:6575: checking for pid_t
configure:6575: g++ -std=c++11 -c  -pipe -Wall -D_LARGEFILE_SOURCE -D_LARGEFILE64_SOURCE  conftest.cpp >&5
configure:6575: $? = 0
configure:6575: g++ -std=c++11 -c  -pipe -Wall -D_LARGEFILE_SOURCE -D_LARGEFILE64_SOURCE  conftest.cpp >&5
conftest.cpp: In function 'int main()':
conftest.cpp:60:19: error: expected primary-expression before ')' token
   60 | if (sizeof ((pid_t)))
      |                   ^
configure:6575: $? = 1
configure: failed program was:
| /* confdefs.h */
| #define PACKAGE_NAME ""
| #define PACKAGE_TARNAME ""
| #define PACKAGE_VERSION ""
| #define PACKAGE_STRING ""
| #define PACKAGE_BUGREPORT ""
| #define PACKAGE_URL ""
| #define PACKAGE "libpbd"
| #define VERSION "2.6.0"
| #define HAVE_CXX11 1
| #define HAVE_DIRENT_H 1
| #define HAVE_STDIO_H 1
| #define HAVE_STDLIB_H 1
| #define HAVE_STRING_H 1
| #define HAVE_INTTYPES_H 1
| #define HAVE_STDINT_H 1
| #define HAVE_STRINGS_H 1
| #define HAVE_SYS_STAT_H 1
| #define HAVE_SYS_TYPES_H 1
| #define HAVE_UNISTD_H 1
| #define HAVE_SYS_TIME_H 1
| #define STDC_HEADERS 1
| #define HAVE_FCNTL_H 1
| #define HAVE_LIMITS_H 1
| #define HAVE_SYS_TIME_H 1
| #define HAVE_UNISTD_H 1
| /* end confdefs.h.  */
| #include <stddef.h>
| #ifdef HAVE_STDIO_H
| # include <stdio.h>
| #endif
| #ifdef HAVE_STDLIB_H
| # include <stdlib.h>
| #endif
| #ifdef HAVE_STRING_H
| # include <string.h>
| #endif
| #ifdef HAVE_INTTYPES_H
| # include <inttypes.h>
| #endif
| #ifdef HAVE_STDINT_H
| # include <stdint.h>
| #endif
| #ifdef HAVE_STRINGS_H
| # include <strings.h>
| #endif
| #ifdef HAVE_SYS_TYPES_H
| # include <sys/types.h>
| #endif
| #ifdef HAVE_SYS_STAT_H
| # include <sys/stat.h>
| #endif
| #ifdef HAVE_UNISTD_H
| # include <unistd.h>
| #endif
| 
| int
| main (void)
| {
| if (sizeof ((pid_t)))
| 	    return 0;
|   ;
|   return 0;
| }
configure:6575: result: yes
configure:6622: checking for working memcmp
configure:6667: g++ -std=c++11 -o conftest  -pipe -Wall -D_LARGEFILE_SOURCE -D_LARGEFILE64_SOURCE   conftest.cpp  >&5
configure:6667: $? = 0
configure:6667: ./conftest
configure:6667: $? = 0
configure:6678: result: yes
configure:6687: checking return type of signal handlers
configure:6706: g++ -std=c++11 -c  -pipe -Wall -D_LARGEFILE_SOURCE -D_LARGEFILE64_SOURCE  conftest.cpp >&5
conftest.cpp: In function 'int main()':
conftest.cpp:35:25: error: void value not ignored as it ought to be
   35 | return *(signal (0, 0)) (0) == 1;
      |         ~~~~~~~~~~~~~~~~^~~
configure:6706: $? = 1
configure: failed program was:
| /* confdefs.h */
| #define PACKAGE_NAME ""
| #define PACKAGE_TARNAME ""
| #define PACKAGE_VERSION ""
| #define PACKAGE_STRING ""
| #define PACKAGE_BUGREPORT ""
| #define PACKAGE_URL ""
| #define PACKAGE "libpbd"
| #define VERSION "2.6.0"
| #define HAVE_CXX11 1
| #define HAVE_DIRENT_H 1
| #define HAVE_STDIO_H 1
| #define HAVE_STDLIB_H 1
| #define HAVE_STRING_H 1
| #define HAVE_INTTYPES_H 1
| #define HAVE_STDINT_H 1
| #define HAVE_STRINGS_H 1
| #define HAVE_SYS_STAT_H 1
| #define HAVE_SYS_TYPES_H 1
| #define HAVE_UNISTD_H 1
| #define HAVE_SYS_TIME_H 1
| #define STDC_HEADERS 1
| #define HAVE_FCNTL_H 1
| #define HAVE_LIMITS_H 1
| #define HAVE_SYS_TIME_H 1
| #define HAVE_UNISTD_H 1
| #define TIME_WITH_SYS_TIME 1
| /* end confdefs.h.  */
| #include <sys/types.h>
| #include <signal.h>
| 
| int
| main (void)
| {
| return *(signal (0, 0)) (0) == 1;
|   ;
|   return 0;
| }
configure:6714: result: void
configure:6724: checking for vprintf
configure:6724: g++ -std=c++11 -o conftest  -pipe -Wall -D_LARGEFILE_SOURCE -D_LARGEFILE64_SOURCE   conftest.cpp  >&5
conftest.cpp:46:6: warning: declaration of 'char vprintf()' conflicts with built-in declaration 'int vprintf(const char*, __va_list)' [-Wbuiltin-declaration-mismatch]
   46 | char vprintf ();
      |      ^~~~~~~
configure:6724: $? = 0
configure:6724: result: yes
configure:6747: checking for library containing getmntent
configure:6776: g++ -std=c++11 -o conftest  -pipe -Wall -D_LARGEFILE_SOURCE -D_LARGEFILE64_SOURCE   conftest.cpp  >&5
configure:6776: $? = 0
configure:6796: result: none required
configure:6811: checking for regcomp
configure:6811: g++ -std=c++11 -o conftest  -pipe -Wall -D_LARGEFILE_SOURCE -D_LARGEFILE64_SOURCE   conftest.cpp  >&5
configure:6811: $? = 0
configure:6811: result: yes
configure:6817: checking for select
configure:6817: g++ -std=c++11 -o conftest  -pipe -Wall -D_LARGEFILE_SOURCE -D_LARGEFILE64_SOURCE   conftest.cpp  >&5
configure:6817: $? = 0
configure:6817: result: yes
configure:6823: checking for strdup
configure:6823: g++ -std=c++11 -o conftest  -pipe -Wall -D_LARGEFILE_SOURCE -D_LARGEFILE64_SOURCE   conftest.cpp  >&5
configure:6823: $? = 0
configure:6823: result: yes
configure:6829: checking for strerror
configure:6829: g++ -std=c++11 -o conftest  -pipe -Wall -D_LARGEFILE_SOURCE -D_LARGEFILE64_SOURCE   conftest.cpp  >&5
configure:6829: $? = 0
configure:6829: result: yes
configure:6835: checking for strtol
configure:6835: g++ -std=c++11 -o conftest  -pipe -Wall -D_LARGEFILE_SOURCE -D_LARGEFILE64_SOURCE   conftest.cpp  >&5
configure:6835: $? = 0
configure:6835: result: yes
configure:6842: checking for pthread_create in -lpthread
configure:6864: g++ -std=c++11 -o conftest  -pipe -Wall -D_LARGEFILE_SOURCE -D_LARGEFILE64_SOURCE   conftest.cpp -lpthread   >&5
configure:6864: $? = 0
configure:6874: result: yes
configure:6947: checking for pkg-config
configure:6970: found /usr/bin/pkg-config
configure:6982: result: /usr/bin/pkg-config
configure:7007: checking pkg-config is at least version 0.9.0
configure:7010: result: yes
configure:7020: checking for libxml-2.0 >= 2.5
configure:7027: $PKG_CONFIG --exists --print-errors "libxml-2.0 >= 2.5"
configure:7030: $? = 0
configure:7044: $PKG_CONFIG --exists --print-errors "libxml-2.0 >= 2.5"
configure:7047: $? = 0
configure:7105: result: yes
configure:7112: checking for sigc++-2.0 >= 2.2.10
configure:7119: $PKG_CONFIG --exists --print-errors "sigc++-2.0 >= 2.2.10"
configure:7122: $? = 0
configure:7136: $PKG_CONFIG --exists --print-errors "sigc++-2.0 >= 2.2.10"
configure:7139: $? = 0
configure:7197: result: yes
configure:7343: checking that generated files are newer than configure
configure:7349: result: done
configure:7376: creating ./config.status

## ---------------------- ##
## Running config.status. ##
## ---------------------- ##

This file was extended by config.status, which was
generated by GNU Autoconf 2.71.  Invocation command line was

  CONFIG_FILES    = 
  CONFIG_HEADERS  = 
  CONFIG_LINKS    = 
  CONFIG_COMMANDS = 
  $ ./config.status 

on pine64so

config.status:904: creating Makefile
config.status:904: creating version.cc
config.status:904: creating pbd/Makefile
config.status:904: creating config.h
config.status:1133: executing depfiles commands
config.status:1210: cd .       && sed -e '/# am--include-marker/d' Makefile         | make -f - am--depfiles
make: Nothing to be done for 'am--depfiles'.
config.status:1215: $? = 0

## ---------------- ##
## Cache variables. ##
## ---------------- ##

ac_cv_build=aarch64-unknown-linux-gnu
ac_cv_c_compiler_gnu=yes
ac_cv_cxx_compiler_gnu=yes
ac_cv_env_CCC_set=
ac_cv_env_CCC_value=
ac_cv_env_CC_set=
ac_cv_env_CC_value=
ac_cv_env_CFLAGS_set=
ac_cv_env_CFLAGS_value=
ac_cv_env_CPPFLAGS_set=
ac_cv_env_CPPFLAGS_value=
ac_cv_env_CXXFLAGS_set=
ac_cv_env_CXXFLAGS_value=
ac_cv_env_CXX_set=
ac_cv_env_CXX_value=
ac_cv_env_LDFLAGS_set=
ac_cv_env_LDFLAGS_value=
ac_cv_env_LIBS_set=
ac_cv_env_LIBS_value=
ac_cv_env_PKG_CONFIG_LIBDIR_set=
ac_cv_env_PKG_CONFIG_LIBDIR_value=
ac_cv_env_PKG_CONFIG_PATH_set=
ac_cv_env_PKG_CONFIG_PATH_value=
ac_cv_env_PKG_CONFIG_set=
ac_cv_env_PKG_CONFIG_value=
ac_cv_env_SIGCPP_CFLAGS_set=
ac_cv_env_SIGCPP_CFLAGS_value=
ac_cv_env_SIGCPP_LIBS_set=
ac_cv_env_SIGCPP_LIBS_value=
ac_cv_env_XML_CFLAGS_set=
ac_cv_env_XML_CFLAGS_value=
ac_cv_env_XML_LIBS_set=
ac_cv_env_XML_LIBS_value=
ac_cv_env_build_alias_set=
ac_cv_env_build_alias_value=
ac_cv_env_host_alias_set=
ac_cv_env_host_alias_value=
ac_cv_env_target_alias_set=
ac_cv_env_target_alias_value=
ac_cv_func_getmntent=yes
ac_cv_func_memcmp_working=yes
ac_cv_func_regcomp=yes
ac_cv_func_select=yes
ac_cv_func_strdup=yes
ac_cv_func_strerror=yes
ac_cv_func_strtol=yes
ac_cv_func_vprintf=yes
ac_cv_header_dirent_dirent_h=yes
ac_cv_header_fcntl_h=yes
ac_cv_header_inttypes_h=yes
ac_cv_header_limits_h=yes
ac_cv_header_stdint_h=yes
ac_cv_header_stdio_h=yes
ac_cv_header_stdlib_h=yes
ac_cv_header_string_h=yes
ac_cv_header_strings_h=yes
ac_cv_header_sys_stat_h=yes
ac_cv_header_sys_time_h=yes
ac_cv_header_sys_types_h=yes
ac_cv_header_unistd_h=yes
ac_cv_host=aarch64-unknown-linux-gnu
ac_cv_lib_pthread_pthread_create=yes
ac_cv_objext=o
ac_cv_path_EGREP='/usr/bin/grep -E'
ac_cv_path_GREP=/usr/bin/grep
ac_cv_path_ac_pt_PKG_CONFIG=/usr/bin/pkg-config
ac_cv_path_install='/usr/bin/install -c'
ac_cv_path_mkdir=/usr/bin/mkdir
ac_cv_prog_AWK=mawk
ac_cv_prog_ac_ct_CC=gcc
ac_cv_prog_ac_ct_CXX=g++
ac_cv_prog_ac_ct_RANLIB=ranlib
ac_cv_prog_cc_c11=
ac_cv_prog_cc_g=yes
ac_cv_prog_cc_stdc=
ac_cv_prog_cxx_cxx11=
ac_cv_prog_cxx_g=yes
ac_cv_prog_cxx_stdcxx=
ac_cv_prog_make_make_set=yes
ac_cv_search_getmntent='none required'
ac_cv_search_opendir='none required'
ac_cv_target=aarch64-unknown-linux-gnu
ac_cv_type_off_t=yes
ac_cv_type_pid_t=yes
ac_cv_type_signal=void
am_cv_CC_dependencies_compiler_type=gcc3
am_cv_CXX_dependencies_compiler_type=gcc3
am_cv_make_support_nested_variables=yes
am_cv_prog_cc_c_o=yes
ax_cv_cxx_compile_cxx11__std_cpp11=yes
pkg_cv_SIGCPP_CFLAGS='-I/usr/include/sigc++-2.0 -I/usr/lib/aarch64-linux-gnu/sigc++-2.0/include '
pkg_cv_SIGCPP_LIBS='-lsigc-2.0 '
pkg_cv_XML_CFLAGS='-I/usr/include/libxml2 '
pkg_cv_XML_LIBS='-lxml2 '

## ----------------- ##
## Output variables. ##
## ----------------- ##

ACLOCAL='${SHELL} '\''/git_repos/sooperlooper/libs/pbd/missing'\'' aclocal-1.16'
ACLOCAL_AMFLAGS='-I /git_repos/sooperlooper/aclocal '
ACLOCAL_FLAGS='-I /git_repos/sooperlooper/aclocal -I /git_repos/sooperlooper/m4'
AMDEPBACKSLASH='\'
AMDEP_FALSE='#'
AMDEP_TRUE=''
AMTAR='$${TAR-tar}'
AM_BACKSLASH='\'
AM_DEFAULT_V='$(AM_DEFAULT_VERBOSITY)'
AM_DEFAULT_VERBOSITY='1'
AM_V='$(V)'
AUTOCONF='${SHELL} '\''/git_repos/sooperlooper/libs/pbd/missing'\'' autoconf'
AUTOHEADER='${SHELL} '\''/git_repos/sooperlooper/libs/pbd/missing'\'' autoheader'
AUTOMAKE='${SHELL} '\''/git_repos/sooperlooper/libs/pbd/missing'\'' automake-1.16'
AWK='mawk'
CC='gcc'
CCDEPMODE='depmode=gcc3'
CFLAGS='-g -O2  -I/git_repos/sooperlooper/libs/pbd -I/git_repos/sooperlooper/libs/midi++ -I/usr/include/libxml2  -I/usr/include/sigc++-2.0 -I/usr/lib/aarch64-linux-gnu/sigc++-2.0/include  '
CPPFLAGS=''
CSCOPE='cscope'
CTAGS='ctags'
CXX='g++ -std=c++11'
CXXDEPMODE='depmode=gcc3'
CXXFLAGS=' -pipe -Wall -D_LARGEFILE_SOURCE -D_LARGEFILE64_SOURCE -I/git_repos/sooperlooper/libs/pbd -I/git_repos/sooperlooper/libs/midi++ -I/usr/include/libxml2  -I/usr/include/sigc++-2.0 -I/usr/lib/aarch64-linux-gnu/sigc++-2.0/include  '
CYGPATH_W='echo'
DEFS='-DHAVE_CONFIG_H'
DEPDIR='.deps'
ECHO_C=''
ECHO_N='-n'
ECHO_T=''
EGREP='/usr/bin/grep -E'
ETAGS='etags'
EXEEXT=''
GREP='/usr/bin/grep'
HAVE_CXX11='1'
INSTALL_DATA='${INSTALL} -m 644'
INSTALL_PROGRAM='${INSTALL}'
INSTALL_SCRIPT='${INSTALL}'
INSTALL_STRIP_PROGRAM='$(install_sh) -c -s'
LDFLAGS=''
LIBOBJS=''
LIBPBD_MAJOR_VERSION='2'
LIBPBD_MICRO_VERSION='0'
LIBPBD_MINOR_VERSION='6'
LIBPBD_RELEASE='2-6-0'
LIBPBD_SO_VERSION=''
LIBPBD_VERSION='2.6.0'
LIBS='-lpthread  -lxml2  -lsigc-2.0  '
LTLIBOBJS=''
MAKEINFO='${SHELL} '\''/git_repos/sooperlooper/libs/pbd/missing'\'' makeinfo'
MKDIR_P='/usr/bin/mkdir -p'
OBJEXT='o'
PACKAGE='libpbd'
PACKAGE_BUGREPORT=''
PACKAGE_NAME=''
PACKAGE_STRING=''
PACKAGE_TARNAME=''
PACKAGE_URL=''
PACKAGE_VERSION=''
PATH_SEPARATOR=':'
PKG_CONFIG='/usr/bin/pkg-config'
PKG_CONFIG_LIBDIR=''
PKG_CONFIG_PATH=''
RANLIB='ranlib'
SET_MAKE=''
SHELL='/bin/bash'
SIGCPP_CFLAGS='-I/usr/include/sigc++-2.0 -I/usr/lib/aarch64-linux-gnu/sigc++-2.0/include '
SIGCPP_LIBS='-lsigc-2.0 '
STRIP=''
VERSION='2.6.0'
XML_CFLAGS='-I/usr/include/libxml2 '
XML_LIBS='-lxml2 '
ac_ct_CC='gcc'
ac_ct_CXX='g++'
am__EXEEXT_FALSE=''
am__EXEEXT_TRUE='#'
am__fastdepCC_FALSE='#'
am__fastdepCC_TRUE=''
am__fastdepCXX_FALSE='#'
am__fastdepCXX_TRUE=''
am__include='include'
am__isrc=''
am__leading_dot='.'
am__nodep='_no'
am__quote=''
am__tar='$${TAR-tar} chof - "$$tardir"'
am__untar='$${TAR-tar} xf -'
bindir='${exec_prefix}/bin'
build='aarch64-unknown-linux-gnu'
build_alias=''
build_cpu='aarch64'
build_os='linux-gnu'
build_vendor='unknown'
datadir='${datarootdir}'
datarootdir='${prefix}/share'
docdir='${datarootdir}/doc/${PACKAGE}'
dvidir='${docdir}'
exec_prefix='${prefix}'
host='aarch64-unknown-linux-gnu'
host_alias=''
host_cpu='aarch64'
host_os='linux-gnu'
host_vendor='unknown'
htmldir='${docdir}'
includedir='${prefix}/include'
infodir='${datarootdir}/info'
install_sh='${SHELL} /git_repos/sooperlooper/libs/pbd/install-sh'
libdir='${exec_prefix}/lib'
libexecdir='${exec_prefix}/libexec'
localedir='${datarootdir}/locale'
localstatedir='${prefix}/var'
mandir='${datarootdir}/man'
mkdir_p='$(MKDIR_P)'
oldincludedir='/usr/include'
pdfdir='${docdir}'
prefix='/usr'
program_transform_name='s,x,x,'
psdir='${docdir}'
runstatedir='${localstatedir}/run'
sbindir='${exec_prefix}/sbin'
sharedstatedir='${prefix}/com'
sysconfdir='${prefix}/etc'
target='aarch64-unknown-linux-gnu'
target_alias=''
target_cpu='aarch64'
target_os='linux-gnu'
target_vendor='unknown'

## ----------- ##
## confdefs.h. ##
## ----------- ##

/* confdefs.h */
#define PACKAGE_NAME ""
#define PACKAGE_TARNAME ""
#define PACKAGE_VERSION ""
#define PACKAGE_STRING ""
#define PACKAGE_BUGREPORT ""
#define PACKAGE_URL ""
#define PACKAGE "libpbd"
#define VERSION "2.6.0"
#define HAVE_CXX11 1
#define HAVE_DIRENT_H 1
#define HAVE_STDIO_H 1
#define HAVE_STDLIB_H 1
#define HAVE_STRING_H 1
#define HAVE_INTTYPES_H 1
#define HAVE_STDINT_H 1
#define HAVE_STRINGS_H 1
#define HAVE_SYS_STAT_H 1
#define HAVE_SYS_TYPES_H 1
#define HAVE_UNISTD_H 1
#define HAVE_SYS_TIME_H 1
#define STDC_HEADERS 1
#define HAVE_FCNTL_H 1
#define HAVE_LIMITS_H 1
#define HAVE_SYS_TIME_H 1
#define HAVE_UNISTD_H 1
#define TIME_WITH_SYS_TIME 1
#define RETSIGTYPE void
#define HAVE_VPRINTF 1
#define HAVE_GETMNTENT 1
#define HAVE_REGCOMP 1
#define HAVE_SELECT 1
#define HAVE_STRDUP 1
#define HAVE_STRERROR 1
#define HAVE_STRTOL 1
#define HAVE_LIBPTHREAD 1

configure: exit 0
