This file contains any messages produced by compilers while
running configure, to aid debugging if configure makes a mistake.

It was created by jack-audio-connection-kit configure 0.126.0, which was
generated by GNU Autoconf 2.71.  Invocation command line was

  $ ./configure --prefix=/usr

## --------- ##
## Platform. ##
## --------- ##

hostname = pine64so
uname -m = aarch64
uname -r = 5.4.2-rt5-001
uname -s = Linux
uname -v = #108 SMP PREEMPT_RT Wed Oct 11 12:20:26 AEDT 2023

/usr/bin/uname -p = unknown
/bin/uname -X     = unknown

/bin/arch              = aarch64
/usr/bin/arch -k       = unknown
/usr/convex/getsysinfo = unknown
/usr/bin/hostinfo      = unknown
/bin/machine           = unknown
/usr/bin/oslevel       = unknown
/bin/universe          = unknown

PATH: /usr/local/bin/
PATH: /usr/bin/
PATH: /bin/
PATH: /usr/local/games/
PATH: /usr/games/


## ----------- ##
## Core tests. ##
## ----------- ##

configure:2974: looking for aux files: ltmain.sh compile missing install-sh config.guess config.sub
configure:2987:  trying ./config/
configure:3016:   ./config/ltmain.sh found
configure:3016:   ./config/compile found
configure:3016:   ./config/missing found
configure:2998:   ./config/install-sh found
configure:3016:   ./config/config.guess found
configure:3016:   ./config/config.sub found
configure:3147: checking existing, conflicting JACK installs
configure:3190: result: no
configure:3201: checking build system type
configure:3216: result: aarch64-unknown-linux-gnu
configure:3291: checking for a BSD-compatible install
configure:3364: result: /usr/bin/install -c
configure:3375: checking whether build environment is sane
configure:3430: result: yes
configure:3589: checking for a race-free mkdir -p
configure:3633: result: /usr/bin/mkdir -p
configure:3640: checking for gawk
configure:3675: result: no
configure:3640: checking for mawk
configure:3661: found /usr/bin/mawk
configure:3672: result: mawk
configure:3683: checking whether make sets $(MAKE)
configure:3706: result: yes
configure:3736: checking whether make supports nested variables
configure:3754: result: yes
configure:3902: checking whether make supports nested variables
configure:3920: result: yes
configure:4063: checking for gcc
configure:4084: found /usr/bin/gcc
configure:4095: result: gcc
configure:4448: checking for C compiler version
configure:4457: gcc --version >&5
gcc (Debian 12.2.0-14) 12.2.0
Copyright (C) 2022 Free Software Foundation, Inc.
This is free software; see the source for copying conditions.  There is NO
warranty; not even for MERCHANTABILITY or FITNESS FOR A PARTICULAR PURPOSE.

configure:4468: $? = 0
configure:4457: gcc -v >&5
Using built-in specs.
COLLECT_GCC=gcc
COLLECT_LTO_WRAPPER=/usr/lib/gcc/aarch64-linux-gnu/12/lto-wrapper
Target: aarch64-linux-gnu
Configured with: ../src/configure -v --with-pkgversion='Debian 12.2.0-14' --with-bugurl=file:///usr/share/doc/gcc-12/README.Bugs --enable-languages=c,ada,c++,go,d,fortran,objc,obj-c++,m2 --prefix=/usr --with-gcc-major-version-only --program-suffix=-12 --program-prefix=aarch64-linux-gnu- --enable-shared --enable-linker-build-id --libexecdir=/usr/lib --without-included-gettext --enable-threads=posix --libdir=/usr/lib --enable-nls --enable-clocale=gnu --enable-libstdcxx-debug --enable-libstdcxx-time=yes --with-default-libstdcxx-abi=new --enable-gnu-unique-object --disable-libquadmath --disable-libquadmath-support --enable-plugin --enable-default-pie --with-system-zlib --enable-libphobos-checking=release --with-target-system-zlib=auto --enable-objc-gc=auto --enable-multiarch --enable-fix-cortex-a53-843419 --disable-werror --enable-checking=release --build=aarch64-linux-gnu --host=aarch64-linux-gnu --target=aarch64-linux-gnu
Thread model: posix
Supported LTO compression algorithms: zlib zstd
gcc version 12.2.0 (Debian 12.2.0-14) 
configure:4468: $? = 0
configure:4457: gcc -V >&5
gcc: error: unrecognized command-line option '-V'
gcc: fatal error: no input files
compilation terminated.
configure:4468: $? = 1
configure:4457: gcc -qversion >&5
gcc: error: unrecognized command-line option '-qversion'; did you mean '--version'?
gcc: fatal error: no input files
compilation terminated.
configure:4468: $? = 1
configure:4457: gcc -version >&5
gcc: error: unrecognized command-line option '-version'
gcc: fatal error: no input files
compilation terminated.
configure:4468: $? = 1
configure:4488: checking whether the C compiler works
configure:4510: gcc    conftest.c  >&5
configure:4514: $? = 0
configure:4564: result: yes
configure:4567: checking for C compiler default output file name
configure:4569: result: a.out
configure:4575: checking for suffix of executables
configure:4582: gcc -o conftest    conftest.c  >&5
configure:4586: $? = 0
configure:4609: result: 
configure:4631: checking whether we are cross compiling
configure:4639: gcc -o conftest    conftest.c  >&5
configure:4643: $? = 0
configure:4650: ./conftest
configure:4654: $? = 0
configure:4669: result: no
configure:4674: checking for suffix of object files
configure:4697: gcc -c   conftest.c >&5
configure:4701: $? = 0
configure:4723: result: o
configure:4727: checking whether the compiler supports GNU C
configure:4747: gcc -c   conftest.c >&5
configure:4747: $? = 0
configure:4757: result: yes
configure:4768: checking whether gcc accepts -g
configure:4789: gcc -c -g  conftest.c >&5
configure:4789: $? = 0
configure:4833: result: yes
configure:4853: checking for gcc option to enable C11 features
configure:4868: gcc  -c -g -O2  conftest.c >&5
configure:4868: $? = 0
configure:4886: result: none needed
configure:5002: checking whether gcc understands -c and -o together
configure:5025: gcc -c conftest.c -o conftest2.o
configure:5028: $? = 0
configure:5025: gcc -c conftest.c -o conftest2.o
configure:5028: $? = 0
configure:5040: result: yes
configure:5060: checking whether make supports the include directive
configure:5075: make -f confmf.GNU && cat confinc.out
this is the am__doit target
configure:5078: $? = 0
configure:5097: result: yes (GNU style)
configure:5123: checking dependency style of gcc
configure:5235: result: gcc3
configure:5319: checking for g++
configure:5340: found /usr/bin/g++
configure:5351: result: g++
configure:5378: checking for C++ compiler version
configure:5387: g++ --version >&5
g++ (Debian 12.2.0-14) 12.2.0
Copyright (C) 2022 Free Software Foundation, Inc.
This is free software; see the source for copying conditions.  There is NO
warranty; not even for MERCHANTABILITY or FITNESS FOR A PARTICULAR PURPOSE.

configure:5398: $? = 0
configure:5387: g++ -v >&5
Using built-in specs.
COLLECT_GCC=g++
COLLECT_LTO_WRAPPER=/usr/lib/gcc/aarch64-linux-gnu/12/lto-wrapper
Target: aarch64-linux-gnu
Configured with: ../src/configure -v --with-pkgversion='Debian 12.2.0-14' --with-bugurl=file:///usr/share/doc/gcc-12/README.Bugs --enable-languages=c,ada,c++,go,d,fortran,objc,obj-c++,m2 --prefix=/usr --with-gcc-major-version-only --program-suffix=-12 --program-prefix=aarch64-linux-gnu- --enable-shared --enable-linker-build-id --libexecdir=/usr/lib --without-included-gettext --enable-threads=posix --libdir=/usr/lib --enable-nls --enable-clocale=gnu --enable-libstdcxx-debug --enable-libstdcxx-time=yes --with-default-libstdcxx-abi=new --enable-gnu-unique-object --disable-libquadmath --disable-libquadmath-support --enable-plugin --enable-default-pie --with-system-zlib --enable-libphobos-checking=release --with-target-system-zlib=auto --enable-objc-gc=auto --enable-multiarch --enable-fix-cortex-a53-843419 --disable-werror --enable-checking=release --build=aarch64-linux-gnu --host=aarch64-linux-gnu --target=aarch64-linux-gnu
Thread model: posix
Supported LTO compression algorithms: zlib zstd
gcc version 12.2.0 (Debian 12.2.0-14) 
configure:5398: $? = 0
configure:5387: g++ -V >&5
g++: error: unrecognized command-line option '-V'
g++: fatal error: no input files
compilation terminated.
configure:5398: $? = 1
configure:5387: g++ -qversion >&5
g++: error: unrecognized command-line option '-qversion'; did you mean '--version'?
g++: fatal error: no input files
compilation terminated.
configure:5398: $? = 1
configure:5402: checking whether the compiler supports GNU C++
configure:5422: g++ -c   conftest.cpp >&5
configure:5422: $? = 0
configure:5432: result: yes
configure:5443: checking whether g++ accepts -g
configure:5464: g++ -c -g  conftest.cpp >&5
configure:5464: $? = 0
configure:5508: result: yes
configure:5528: checking for g++ option to enable C++11 features
configure:5543: g++  -c -g -O2  conftest.cpp >&5
conftest.cpp: In function 'int main(int, char**)':
conftest.cpp:178:25: warning: empty parentheses were disambiguated as a function declaration [-Wvexing-parse]
  178 |   cxx11test::delegate d2();
      |                         ^~
conftest.cpp:178:25: note: remove parentheses to default-initialize a variable
  178 |   cxx11test::delegate d2();
      |                         ^~
      |                         --
conftest.cpp:178:25: note: or replace parentheses with braces to value-initialize a variable
configure:5543: $? = 0
configure:5561: result: none needed
configure:5627: checking dependency style of g++
configure:5739: result: gcc3
configure:5754: checking host system type
configure:5768: result: aarch64-unknown-linux-gnu
configure:5788: checking for a sed that does not truncate output
configure:5858: result: /usr/bin/sed
configure:5876: checking for grep that handles long lines and -e
configure:5940: result: /usr/bin/grep
configure:5945: checking for egrep
configure:6013: result: /usr/bin/grep -E
configure:6018: checking for fgrep
configure:6086: result: /usr/bin/grep -F
configure:6113: checking how to print strings
configure:6140: result: printf
configure:6174: checking for ld used by gcc
configure:6242: result: /usr/bin/ld
configure:6249: checking if the linker (/usr/bin/ld) is GNU ld
configure:6265: result: yes
configure:6320: checking for BSD- or MS-compatible name lister (nm)
configure:6375: result: /usr/bin/nm -B
configure:6515: checking the name lister (/usr/bin/nm -B) interface
configure:6523: gcc -c -g -O2  conftest.c >&5
configure:6526: /usr/bin/nm -B "conftest.o"
configure:6529: output
0000000000000000 B some_variable
configure:6536: result: BSD nm
configure:6539: checking whether ln -s works
configure:6543: result: yes
configure:6551: checking the maximum length of command line arguments
configure:6683: result: 1572864
configure:6731: checking how to convert aarch64-unknown-linux-gnu file names to aarch64-unknown-linux-gnu format
configure:6772: result: func_convert_file_noop
configure:6779: checking how to convert aarch64-unknown-linux-gnu file names to toolchain format
configure:6800: result: func_convert_file_noop
configure:6807: checking for /usr/bin/ld option to reload object files
configure:6815: result: -r
configure:6894: checking for file
configure:6915: found /usr/bin/file
configure:6926: result: file
configure:7002: checking for objdump
configure:7023: found /usr/bin/objdump
configure:7034: result: objdump
configure:7066: checking how to recognize dependent libraries
configure:7267: result: pass_all
configure:7357: checking for dlltool
configure:7392: result: no
configure:7422: checking how to associate runtime and link libraries
configure:7450: result: printf %s\n
configure:7516: checking for ar
configure:7537: found /usr/bin/ar
configure:7548: result: ar
configure:7601: checking for archiver @FILE support
configure:7619: gcc -c -g -O2  conftest.c >&5
configure:7619: $? = 0
configure:7623: ar cr libconftest.a @conftest.lst >&5
configure:7626: $? = 0
configure:7631: ar cr libconftest.a @conftest.lst >&5
ar: conftest.o: No such file or directory
configure:7634: $? = 1
configure:7646: result: @
configure:7709: checking for strip
configure:7730: found /usr/bin/strip
configure:7741: result: strip
configure:7818: checking for ranlib
configure:7839: found /usr/bin/ranlib
configure:7850: result: ranlib
configure:7952: checking command to parse /usr/bin/nm -B output from gcc object
configure:8106: gcc -c -g -O2  conftest.c >&5
configure:8109: $? = 0
configure:8113: /usr/bin/nm -B conftest.o | /usr/bin/sed -n -e 's/^.*[	 ]\([ABCDGIRSTW][ABCDGIRSTW]*\)[	 ][	 ]*\([_A-Za-z][_A-Za-z0-9]*\)$/\1 \2 \2/p' | /usr/bin/sed '/ __gnu_lto/d' > conftest.nm
configure:8179: gcc -o conftest -g -O2   conftest.c conftstm.o >&5
configure:8182: $? = 0
configure:8220: result: ok
configure:8267: checking for sysroot
configure:8298: result: no
configure:8305: checking for a working dd
configure:8349: result: /usr/bin/dd
configure:8353: checking how to truncate binary pipes
configure:8369: result: /usr/bin/dd bs=4096 count=1
configure:8706: checking for mt
configure:8727: found /usr/bin/mt
configure:8738: result: mt
configure:8761: checking if mt is a manifest tool
configure:8768: mt '-?'
configure:8776: result: no
configure:9501: checking for stdio.h
configure:9501: gcc -c -g -O2  conftest.c >&5
configure:9501: $? = 0
configure:9501: result: yes
configure:9501: checking for stdlib.h
configure:9501: gcc -c -g -O2  conftest.c >&5
configure:9501: $? = 0
configure:9501: result: yes
configure:9501: checking for string.h
configure:9501: gcc -c -g -O2  conftest.c >&5
configure:9501: $? = 0
configure:9501: result: yes
configure:9501: checking for inttypes.h
configure:9501: gcc -c -g -O2  conftest.c >&5
configure:9501: $? = 0
configure:9501: result: yes
configure:9501: checking for stdint.h
configure:9501: gcc -c -g -O2  conftest.c >&5
configure:9501: $? = 0
configure:9501: result: yes
configure:9501: checking for strings.h
configure:9501: gcc -c -g -O2  conftest.c >&5
configure:9501: $? = 0
configure:9501: result: yes
configure:9501: checking for sys/stat.h
configure:9501: gcc -c -g -O2  conftest.c >&5
configure:9501: $? = 0
configure:9501: result: yes
configure:9501: checking for sys/types.h
configure:9501: gcc -c -g -O2  conftest.c >&5
configure:9501: $? = 0
configure:9501: result: yes
configure:9501: checking for unistd.h
configure:9501: gcc -c -g -O2  conftest.c >&5
configure:9501: $? = 0
configure:9501: result: yes
configure:9526: checking for dlfcn.h
configure:9526: gcc -c -g -O2  conftest.c >&5
configure:9526: $? = 0
configure:9526: result: yes
configure:9734: checking for objdir
configure:9750: result: .libs
configure:10014: checking if gcc supports -fno-rtti -fno-exceptions
configure:10033: gcc -c -g -O2  -fno-rtti -fno-exceptions conftest.c >&5
cc1: warning: command-line option '-fno-rtti' is valid for C++/D/ObjC++ but not for C
configure:10037: $? = 0
configure:10050: result: no
configure:10414: checking for gcc option to produce PIC
configure:10422: result: -fPIC -DPIC
configure:10430: checking if gcc PIC flag -fPIC -DPIC works
configure:10449: gcc -c -g -O2  -fPIC -DPIC -DPIC conftest.c >&5
configure:10453: $? = 0
configure:10466: result: yes
configure:10495: checking if gcc static flag -static works
configure:10524: result: yes
configure:10539: checking if gcc supports -c -o file.o
configure:10561: gcc -c -g -O2  -o out/conftest2.o conftest.c >&5
configure:10565: $? = 0
configure:10587: result: yes
configure:10595: checking if gcc supports -c -o file.o
configure:10643: result: yes
configure:10676: checking whether the gcc linker (/usr/bin/ld) supports shared libraries
configure:11950: result: yes
configure:11987: checking whether -lc should be explicitly linked in
configure:11996: gcc -c -g -O2  conftest.c >&5
configure:11999: $? = 0
configure:12014: gcc -shared  -fPIC -DPIC conftest.o  -v -Wl,-soname -Wl,conftest -o conftest 2\>\&1 \| /usr/bin/grep  -lc  \>/dev/null 2\>\&1
configure:12017: $? = 0
configure:12031: result: no
configure:12191: checking dynamic linker characteristics
configure:12773: gcc -o conftest -g -O2   -Wl,-rpath -Wl,/foo conftest.c  >&5
configure:12773: $? = 0
configure:13024: result: GNU/Linux ld.so
configure:13146: checking how to hardcode library paths into programs
configure:13171: result: immediate
configure:13723: checking whether stripping libraries is possible
configure:13732: result: yes
configure:13774: checking if libtool supports shared libraries
configure:13776: result: yes
configure:13779: checking whether to build shared libraries
configure:13804: result: yes
configure:13807: checking whether to build static libraries
configure:13811: result: no
configure:13834: checking how to run the C++ preprocessor
configure:13856: g++ -E  conftest.cpp
configure:13856: $? = 0
configure:13871: g++ -E  conftest.cpp
conftest.cpp:24:10: fatal error: ac_nonexistent.h: No such file or directory
   24 | #include <ac_nonexistent.h>
      |          ^~~~~~~~~~~~~~~~~~
compilation terminated.
configure:13871: $? = 1
configure: failed program was:
| /* confdefs.h */
| #define PACKAGE_NAME "jack-audio-connection-kit"
| #define PACKAGE_TARNAME "jack-audio-connection-kit"
| #define PACKAGE_VERSION "0.126.0"
| #define PACKAGE_STRING "jack-audio-connection-kit 0.126.0"
| #define PACKAGE_BUGREPORT "jack-devel@lists.jackaudio.org"
| #define PACKAGE_URL "http://www.jackaudio.org/"
| #define PROTOCOL_VERSION "25"
| #define PACKAGE "jack-audio-connection-kit"
| #define VERSION "0.126.0"
| #define HAVE_STDIO_H 1
| #define HAVE_STDLIB_H 1
| #define HAVE_STRING_H 1
| #define HAVE_INTTYPES_H 1
| #define HAVE_STDINT_H 1
| #define HAVE_STRINGS_H 1
| #define HAVE_SYS_STAT_H 1
| #define HAVE_SYS_TYPES_H 1
| #define HAVE_UNISTD_H 1
| #define STDC_HEADERS 1
| #define HAVE_DLFCN_H 1
| #define LT_OBJDIR ".libs/"
| /* end confdefs.h.  */
| #include <ac_nonexistent.h>
configure:13898: result: g++ -E
configure:13912: g++ -E  conftest.cpp
configure:13912: $? = 0
configure:13927: g++ -E  conftest.cpp
conftest.cpp:24:10: fatal error: ac_nonexistent.h: No such file or directory
   24 | #include <ac_nonexistent.h>
      |          ^~~~~~~~~~~~~~~~~~
compilation terminated.
configure:13927: $? = 1
configure: failed program was:
| /* confdefs.h */
| #define PACKAGE_NAME "jack-audio-connection-kit"
| #define PACKAGE_TARNAME "jack-audio-connection-kit"
| #define PACKAGE_VERSION "0.126.0"
| #define PACKAGE_STRING "jack-audio-connection-kit 0.126.0"
| #define PACKAGE_BUGREPORT "jack-devel@lists.jackaudio.org"
| #define PACKAGE_URL "http://www.jackaudio.org/"
| #define PROTOCOL_VERSION "25"
| #define PACKAGE "jack-audio-connection-kit"
| #define VERSION "0.126.0"
| #define HAVE_STDIO_H 1
| #define HAVE_STDLIB_H 1
| #define HAVE_STRING_H 1
| #define HAVE_INTTYPES_H 1
| #define HAVE_STDINT_H 1
| #define HAVE_STRINGS_H 1
| #define HAVE_SYS_STAT_H 1
| #define HAVE_SYS_TYPES_H 1
| #define HAVE_UNISTD_H 1
| #define STDC_HEADERS 1
| #define HAVE_DLFCN_H 1
| #define LT_OBJDIR ".libs/"
| /* end confdefs.h.  */
| #include <ac_nonexistent.h>
configure:14092: checking for ld used by g++
configure:14160: result: /usr/bin/ld
configure:14167: checking if the linker (/usr/bin/ld) is GNU ld
configure:14183: result: yes
configure:14238: checking whether the g++ linker (/usr/bin/ld) supports shared libraries
configure:15316: result: yes
configure:15352: g++ -c -g -O2  conftest.cpp >&5
configure:15355: $? = 0
configure:15836: checking for g++ option to produce PIC
configure:15844: result: -fPIC -DPIC
configure:15852: checking if g++ PIC flag -fPIC -DPIC works
configure:15871: g++ -c -g -O2  -fPIC -DPIC -DPIC conftest.cpp >&5
configure:15875: $? = 0
configure:15888: result: yes
configure:15911: checking if g++ static flag -static works
configure:15940: result: yes
configure:15952: checking if g++ supports -c -o file.o
configure:15974: g++ -c -g -O2  -o out/conftest2.o conftest.cpp >&5
configure:15978: $? = 0
configure:16000: result: yes
configure:16005: checking if g++ supports -c -o file.o
configure:16053: result: yes
configure:16083: checking whether the g++ linker (/usr/bin/ld) supports shared libraries
configure:16126: result: yes
configure:16268: checking dynamic linker characteristics
configure:17028: result: GNU/Linux ld.so
configure:17093: checking how to hardcode library paths into programs
configure:17118: result: immediate
configure:17179: checking whether ln -s works
configure:17183: result: yes
configure:17191: checking whether byte ordering is bigendian
configure:17207: gcc -c -g -O2  conftest.c >&5
conftest.c:25:16: error: unknown type name 'not'
   25 |                not a universal capable compiler
      |                ^~~
conftest.c:25:22: error: expected '=', ',', ';', 'asm' or '__attribute__' before 'universal'
   25 |                not a universal capable compiler
      |                      ^~~~~~~~~
conftest.c:25:22: error: unknown type name 'universal'
configure:17207: $? = 1
configure: failed program was:
| /* confdefs.h */
| #define PACKAGE_NAME "jack-audio-connection-kit"
| #define PACKAGE_TARNAME "jack-audio-connection-kit"
| #define PACKAGE_VERSION "0.126.0"
| #define PACKAGE_STRING "jack-audio-connection-kit 0.126.0"
| #define PACKAGE_BUGREPORT "jack-devel@lists.jackaudio.org"
| #define PACKAGE_URL "http://www.jackaudio.org/"
| #define PROTOCOL_VERSION "25"
| #define PACKAGE "jack-audio-connection-kit"
| #define VERSION "0.126.0"
| #define HAVE_STDIO_H 1
| #define HAVE_STDLIB_H 1
| #define HAVE_STRING_H 1
| #define HAVE_INTTYPES_H 1
| #define HAVE_STDINT_H 1
| #define HAVE_STRINGS_H 1
| #define HAVE_SYS_STAT_H 1
| #define HAVE_SYS_TYPES_H 1
| #define HAVE_UNISTD_H 1
| #define STDC_HEADERS 1
| #define HAVE_DLFCN_H 1
| #define LT_OBJDIR ".libs/"
| /* end confdefs.h.  */
| #ifndef __APPLE_CC__
| 	       not a universal capable compiler
| 	     #endif
| 	     typedef int dummy;
| 
configure:17253: gcc -c -g -O2  conftest.c >&5
configure:17253: $? = 0
configure:17272: gcc -c -g -O2  conftest.c >&5
conftest.c: In function 'main':
conftest.c:31:18: error: unknown type name 'not'; did you mean 'ino_t'?
   31 |                  not big endian
      |                  ^~~
      |                  ino_t
conftest.c:31:26: error: expected '=', ',', ';', 'asm' or '__attribute__' before 'endian'
   31 |                  not big endian
      |                          ^~~~~~
configure:17272: $? = 1
configure: failed program was:
| /* confdefs.h */
| #define PACKAGE_NAME "jack-audio-connection-kit"
| #define PACKAGE_TARNAME "jack-audio-connection-kit"
| #define PACKAGE_VERSION "0.126.0"
| #define PACKAGE_STRING "jack-audio-connection-kit 0.126.0"
| #define PACKAGE_BUGREPORT "jack-devel@lists.jackaudio.org"
| #define PACKAGE_URL "http://www.jackaudio.org/"
| #define PROTOCOL_VERSION "25"
| #define PACKAGE "jack-audio-connection-kit"
| #define VERSION "0.126.0"
| #define HAVE_STDIO_H 1
| #define HAVE_STDLIB_H 1
| #define HAVE_STRING_H 1
| #define HAVE_INTTYPES_H 1
| #define HAVE_STDINT_H 1
| #define HAVE_STRINGS_H 1
| #define HAVE_SYS_STAT_H 1
| #define HAVE_SYS_TYPES_H 1
| #define HAVE_UNISTD_H 1
| #define STDC_HEADERS 1
| #define HAVE_DLFCN_H 1
| #define LT_OBJDIR ".libs/"
| /* end confdefs.h.  */
| #include <sys/types.h>
| 		#include <sys/param.h>
| 
| int
| main (void)
| {
| #if BYTE_ORDER != BIG_ENDIAN
| 		 not big endian
| 		#endif
| 
|   ;
|   return 0;
| }
configure:17406: result: no
configure:17428: checking platform dependencies
configure:17492: checking for string.h
configure:17492: result: yes
configure:17492: checking for strings.h
configure:17492: result: yes
configure:17492: checking for db.h
configure:17492: gcc -c   conftest.c >&5
configure:17492: $? = 0
configure:17492: result: yes
configure:17507: checking for getopt.h
configure:17507: gcc -c   conftest.c >&5
configure:17507: $? = 0
configure:17507: result: yes
configure:17534: checking for /usr/include/nptl/pthread.h
configure:17534: gcc -c   conftest.c >&5
conftest.c:58:10: fatal error: /usr/include/nptl/pthread.h: No such file or directory
   58 | #include </usr/include/nptl/pthread.h>
      |          ^~~~~~~~~~~~~~~~~~~~~~~~~~~~~
compilation terminated.
configure:17534: $? = 1
configure: failed program was:
| /* confdefs.h */
| #define PACKAGE_NAME "jack-audio-connection-kit"
| #define PACKAGE_TARNAME "jack-audio-connection-kit"
| #define PACKAGE_VERSION "0.126.0"
| #define PACKAGE_STRING "jack-audio-connection-kit 0.126.0"
| #define PACKAGE_BUGREPORT "jack-devel@lists.jackaudio.org"
| #define PACKAGE_URL "http://www.jackaudio.org/"
| #define PROTOCOL_VERSION "25"
| #define PACKAGE "jack-audio-connection-kit"
| #define VERSION "0.126.0"
| #define HAVE_STDIO_H 1
| #define HAVE_STDLIB_H 1
| #define HAVE_STRING_H 1
| #define HAVE_INTTYPES_H 1
| #define HAVE_STDINT_H 1
| #define HAVE_STRINGS_H 1
| #define HAVE_SYS_STAT_H 1
| #define HAVE_SYS_TYPES_H 1
| #define HAVE_UNISTD_H 1
| #define STDC_HEADERS 1
| #define HAVE_DLFCN_H 1
| #define LT_OBJDIR ".libs/"
| #define USE_MD5SUM "1"
| #define JACK_THREAD_STACK_TOUCH 500000
| #define HAVE_STRING_H 1
| #define HAVE_STRINGS_H 1
| #define HAVE_DB_H 1
| #define HAVE_GETOPT_H 1
| /* end confdefs.h.  */
| #include <stddef.h>
| #ifdef HAVE_STDIO_H
| # include <stdio.h>
| #endif
| #ifdef HAVE_STDLIB_H
| # include <stdlib.h>
| #endif
| #ifdef HAVE_STRING_H
| # include <string.h>
| #endif
| #ifdef HAVE_INTTYPES_H
| # include <inttypes.h>
| #endif
| #ifdef HAVE_STDINT_H
| # include <stdint.h>
| #endif
| #ifdef HAVE_STRINGS_H
| # include <strings.h>
| #endif
| #ifdef HAVE_SYS_TYPES_H
| # include <sys/types.h>
| #endif
| #ifdef HAVE_SYS_STAT_H
| # include <sys/stat.h>
| #endif
| #ifdef HAVE_UNISTD_H
| # include <unistd.h>
| #endif
| #include </usr/include/nptl/pthread.h>
configure:17534: result: no
configure:17542: checking for getopt_long
configure:17542: gcc -o conftest    conftest.c  >&5
configure:17542: $? = 0
configure:17542: result: yes
configure:17550: checking for gethostent
configure:17550: gcc -o conftest    conftest.c  >&5
configure:17550: $? = 0
configure:17550: result: yes
configure:17600: checking for setsockopt
configure:17600: gcc -o conftest    conftest.c  >&5
configure:17600: $? = 0
configure:17600: result: yes
configure:17650: checking for connect
configure:17650: gcc -o conftest    conftest.c  >&5
configure:17650: $? = 0
configure:17650: result: yes
configure:17700: checking for dlopen
configure:17700: gcc -o conftest    conftest.c  >&5
configure:17700: $? = 0
configure:17700: result: yes
configure:17752: checking for pthread_create
configure:17752: gcc -o conftest    conftest.c  >&5
configure:17752: $? = 0
configure:17752: result: yes
configure:17804: checking for on_exit
configure:17804: gcc -o conftest    conftest.c  >&5
configure:17804: $? = 0
configure:17804: result: yes
configure:17810: checking for atexit
configure:17810: gcc -o conftest    conftest.c  >&5
configure:17810: $? = 0
configure:17810: result: yes
configure:17817: checking for posix_memalign
configure:17817: gcc -o conftest    conftest.c  >&5
conftest.c:48:6: warning: conflicting types for built-in function 'posix_memalign'; expected 'int(void **, long unsigned int,  long unsigned int)' [-Wbuiltin-declaration-mismatch]
   48 | char posix_memalign ();
      |      ^~~~~~~~~~~~~~
configure:17817: $? = 0
configure:17817: result: yes
configure:17824: checking for sin in -lm
configure:17847: gcc -o conftest    conftest.c -lm   >&5
conftest.c:37:6: warning: conflicting types for built-in function 'sin'; expected 'double(double)' [-Wbuiltin-declaration-mismatch]
   37 | char sin ();
      |      ^~~
conftest.c:1:1: note: 'sin' is declared in header '<math.h>'
    1 | /* confdefs.h */
configure:17847: $? = 0
configure:17857: result: yes
configure:17867: checking for db_create in -ldb
configure:17890: gcc -o conftest    conftest.c -ldb  -lm  >&5
configure:17890: $? = 0
configure:17900: result: yes
configure:17919: checking how to run the C preprocessor
configure:17945: gcc -E  conftest.c
configure:17945: $? = 0
configure:17960: gcc -E  conftest.c
conftest.c:35:10: fatal error: ac_nonexistent.h: No such file or directory
   35 | #include <ac_nonexistent.h>
      |          ^~~~~~~~~~~~~~~~~~
compilation terminated.
configure:17960: $? = 1
configure: failed program was:
| /* confdefs.h */
| #define PACKAGE_NAME "jack-audio-connection-kit"
| #define PACKAGE_TARNAME "jack-audio-connection-kit"
| #define PACKAGE_VERSION "0.126.0"
| #define PACKAGE_STRING "jack-audio-connection-kit 0.126.0"
| #define PACKAGE_BUGREPORT "jack-devel@lists.jackaudio.org"
| #define PACKAGE_URL "http://www.jackaudio.org/"
| #define PROTOCOL_VERSION "25"
| #define PACKAGE "jack-audio-connection-kit"
| #define VERSION "0.126.0"
| #define HAVE_STDIO_H 1
| #define HAVE_STDLIB_H 1
| #define HAVE_STRING_H 1
| #define HAVE_INTTYPES_H 1
| #define HAVE_STDINT_H 1
| #define HAVE_STRINGS_H 1
| #define HAVE_SYS_STAT_H 1
| #define HAVE_SYS_TYPES_H 1
| #define HAVE_UNISTD_H 1
| #define STDC_HEADERS 1
| #define HAVE_DLFCN_H 1
| #define LT_OBJDIR ".libs/"
| #define USE_MD5SUM "1"
| #define JACK_THREAD_STACK_TOUCH 500000
| #define HAVE_STRING_H 1
| #define HAVE_STRINGS_H 1
| #define HAVE_DB_H 1
| #define HAVE_GETOPT_H 1
| #define HAVE_ON_EXIT 1
| #define HAVE_ATEXIT 1
| #define HAVE_POSIX_MEMALIGN 1
| #define HAVE_LIBM 1
| #define HAVE_LIBDB 1
| /* end confdefs.h.  */
| #include <ac_nonexistent.h>
configure:17987: result: gcc -E
configure:18001: gcc -E  conftest.c
configure:18001: $? = 0
configure:18016: gcc -E  conftest.c
conftest.c:35:10: fatal error: ac_nonexistent.h: No such file or directory
   35 | #include <ac_nonexistent.h>
      |          ^~~~~~~~~~~~~~~~~~
compilation terminated.
configure:18016: $? = 1
configure: failed program was:
| /* confdefs.h */
| #define PACKAGE_NAME "jack-audio-connection-kit"
| #define PACKAGE_TARNAME "jack-audio-connection-kit"
| #define PACKAGE_VERSION "0.126.0"
| #define PACKAGE_STRING "jack-audio-connection-kit 0.126.0"
| #define PACKAGE_BUGREPORT "jack-devel@lists.jackaudio.org"
| #define PACKAGE_URL "http://www.jackaudio.org/"
| #define PROTOCOL_VERSION "25"
| #define PACKAGE "jack-audio-connection-kit"
| #define VERSION "0.126.0"
| #define HAVE_STDIO_H 1
| #define HAVE_STDLIB_H 1
| #define HAVE_STRING_H 1
| #define HAVE_INTTYPES_H 1
| #define HAVE_STDINT_H 1
| #define HAVE_STRINGS_H 1
| #define HAVE_SYS_STAT_H 1
| #define HAVE_SYS_TYPES_H 1
| #define HAVE_UNISTD_H 1
| #define STDC_HEADERS 1
| #define HAVE_DLFCN_H 1
| #define LT_OBJDIR ".libs/"
| #define USE_MD5SUM "1"
| #define JACK_THREAD_STACK_TOUCH 500000
| #define HAVE_STRING_H 1
| #define HAVE_STRINGS_H 1
| #define HAVE_DB_H 1
| #define HAVE_GETOPT_H 1
| #define HAVE_ON_EXIT 1
| #define HAVE_ATEXIT 1
| #define HAVE_POSIX_MEMALIGN 1
| #define HAVE_LIBM 1
| #define HAVE_LIBDB 1
| /* end confdefs.h.  */
| #include <ac_nonexistent.h>
configure:18076: checking for clock_gettime
configure:18076: gcc -o conftest    conftest.c -ldb -lm  >&5
configure:18076: $? = 0
configure:18076: result: yes
configure:18137: checking for clock_nanosleep
configure:18137: gcc -o conftest    conftest.c -ldb -lm  >&5
configure:18137: $? = 0
configure:18137: result: yes
configure:18200: checking for sys/mman.h
configure:18200: gcc -c   conftest.c >&5
configure:18200: $? = 0
configure:18200: result: yes
configure:18203: checking for mlockall
configure:18203: gcc -o conftest    conftest.c -ldb -lm  >&5
configure:18203: $? = 0
configure:18203: result: yes
configure:18277: checking shared memory support
configure:18289: result: System V shmget().
configure:18559: WARNING: no optimization.........................
configure:18891: checking for pthread_barrier_init in -lpthread
configure:18914: gcc -o conftest  -I$(top_srcdir)/config -I$(top_srcdir) -I$(top_srcdir)/include -I$(top_builddir)/include -D_REENTRANT -D_POSIX_PTHREAD_SEMANTICS -Wall  -g   conftest.c -lpthread  -ldb -lm  >&5
configure:18914: $? = 0
configure:18924: result: yes
configure:18996: checking for pkg-config
configure:19019: found /usr/bin/pkg-config
configure:19031: result: /usr/bin/pkg-config
configure:19056: checking pkg-config is at least version 0.9.0
configure:19059: result: yes
configure:19069: checking for samplerate >= 0.1.2
configure:19076: $PKG_CONFIG --exists --print-errors "samplerate >= 0.1.2"
configure:19079: $? = 0
configure:19093: $PKG_CONFIG --exists --print-errors "samplerate >= 0.1.2"
configure:19096: $? = 0
configure:19134: result: yes
configure:19156: checking for celt >= 0.8.0
configure:19163: $PKG_CONFIG --exists --print-errors "celt >= 0.8.0"
Package celt was not found in the pkg-config search path.
Perhaps you should add the directory containing `celt.pc'
to the PKG_CONFIG_PATH environment variable
Package 'celt', required by 'virtual:world', not found
configure:19166: $? = 1
configure:19180: $PKG_CONFIG --exists --print-errors "celt >= 0.8.0"
Package celt was not found in the pkg-config search path.
Perhaps you should add the directory containing `celt.pc'
to the PKG_CONFIG_PATH environment variable
Package 'celt', required by 'virtual:world', not found
configure:19183: $? = 1
configure:19197: result: no
Package 'celt', required by 'virtual:world', not found
configure:19228: checking for celt >= 0.7.0
configure:19235: $PKG_CONFIG --exists --print-errors "celt >= 0.7.0"
Package celt was not found in the pkg-config search path.
Perhaps you should add the directory containing `celt.pc'
to the PKG_CONFIG_PATH environment variable
Package 'celt', required by 'virtual:world', not found
configure:19238: $? = 1
configure:19252: $PKG_CONFIG --exists --print-errors "celt >= 0.7.0"
Package celt was not found in the pkg-config search path.
Perhaps you should add the directory containing `celt.pc'
to the PKG_CONFIG_PATH environment variable
Package 'celt', required by 'virtual:world', not found
configure:19255: $? = 1
configure:19269: result: no
Package 'celt', required by 'virtual:world', not found
configure:19300: checking for celt >= 0.5.0
configure:19307: $PKG_CONFIG --exists --print-errors "celt >= 0.5.0"
Package celt was not found in the pkg-config search path.
Perhaps you should add the directory containing `celt.pc'
to the PKG_CONFIG_PATH environment variable
Package 'celt', required by 'virtual:world', not found
configure:19310: $? = 1
configure:19324: $PKG_CONFIG --exists --print-errors "celt >= 0.5.0"
Package celt was not found in the pkg-config search path.
Perhaps you should add the directory containing `celt.pc'
to the PKG_CONFIG_PATH environment variable
Package 'celt', required by 'virtual:world', not found
configure:19327: $? = 1
configure:19341: result: no
Package 'celt', required by 'virtual:world', not found
configure:19373: result: no
configure:19375: WARNING: *** NetJack will not be built with celt support
configure:19534: checking for CoreAudio/CoreAudio.h
configure:19534: gcc -c  -I$(top_srcdir)/config -I$(top_srcdir) -I$(top_srcdir)/include -I$(top_builddir)/include -D_REENTRANT -D_POSIX_PTHREAD_SEMANTICS -Wall  -g  conftest.c >&5
conftest.c:75:10: fatal error: CoreAudio/CoreAudio.h: No such file or directory
   75 | #include <CoreAudio/CoreAudio.h>
      |          ^~~~~~~~~~~~~~~~~~~~~~~
compilation terminated.
configure:19534: $? = 1
configure: failed program was:
| /* confdefs.h */
| #define PACKAGE_NAME "jack-audio-connection-kit"
| #define PACKAGE_TARNAME "jack-audio-connection-kit"
| #define PACKAGE_VERSION "0.126.0"
| #define PACKAGE_STRING "jack-audio-connection-kit 0.126.0"
| #define PACKAGE_BUGREPORT "jack-devel@lists.jackaudio.org"
| #define PACKAGE_URL "http://www.jackaudio.org/"
| #define PROTOCOL_VERSION "25"
| #define PACKAGE "jack-audio-connection-kit"
| #define VERSION "0.126.0"
| #define HAVE_STDIO_H 1
| #define HAVE_STDLIB_H 1
| #define HAVE_STRING_H 1
| #define HAVE_INTTYPES_H 1
| #define HAVE_STDINT_H 1
| #define HAVE_STRINGS_H 1
| #define HAVE_SYS_STAT_H 1
| #define HAVE_SYS_TYPES_H 1
| #define HAVE_UNISTD_H 1
| #define STDC_HEADERS 1
| #define HAVE_DLFCN_H 1
| #define LT_OBJDIR ".libs/"
| #define USE_MD5SUM "1"
| #define JACK_THREAD_STACK_TOUCH 500000
| #define HAVE_STRING_H 1
| #define HAVE_STRINGS_H 1
| #define HAVE_DB_H 1
| #define HAVE_GETOPT_H 1
| #define HAVE_ON_EXIT 1
| #define HAVE_ATEXIT 1
| #define HAVE_POSIX_MEMALIGN 1
| #define HAVE_LIBM 1
| #define HAVE_LIBDB 1
| #define HAVE_PPOLL 1
| #define HAVE_CLOCK_GETTIME 1
| #define HAVE_CLOCK_NANOSLEEP 1
| #define USE_MLOCK 1
| #define JACK_SHM_TYPE "System V"
| #define DO_BUFFER_RESIZE /**/
| #define OLD_TRANSPORT /**/
| #define ADDON_DIR "/usr/lib/jack"
| #define DEFAULT_TMP_DIR "/dev/shm"
| #define USE_BARRIER 1
| #define HAVE_SAMPLERATE 1
| #define HAVE_CELT 0
| /* end confdefs.h.  */
| #include <stddef.h>
| #ifdef HAVE_STDIO_H
| # include <stdio.h>
| #endif
| #ifdef HAVE_STDLIB_H
| # include <stdlib.h>
| #endif
| #ifdef HAVE_STRING_H
| # include <string.h>
| #endif
| #ifdef HAVE_INTTYPES_H
| # include <inttypes.h>
| #endif
| #ifdef HAVE_STDINT_H
| # include <stdint.h>
| #endif
| #ifdef HAVE_STRINGS_H
| # include <strings.h>
| #endif
| #ifdef HAVE_SYS_TYPES_H
| # include <sys/types.h>
| #endif
| #ifdef HAVE_SYS_STAT_H
| # include <sys/stat.h>
| #endif
| #ifdef HAVE_UNISTD_H
| # include <unistd.h>
| #endif
| #include <CoreAudio/CoreAudio.h>
configure:19534: result: no
configure:19566: checking for sys/soundcard.h
configure:19566: gcc -c  -I$(top_srcdir)/config -I$(top_srcdir) -I$(top_srcdir)/include -I$(top_builddir)/include -D_REENTRANT -D_POSIX_PTHREAD_SEMANTICS -Wall  -g  conftest.c >&5
configure:19566: $? = 0
configure:19566: result: yes
configure:19595: checking for sys/audioio.h
configure:19595: gcc -c  -I$(top_srcdir)/config -I$(top_srcdir) -I$(top_srcdir)/include -I$(top_builddir)/include -D_REENTRANT -D_POSIX_PTHREAD_SEMANTICS -Wall  -g  conftest.c >&5
conftest.c:75:10: fatal error: sys/audioio.h: No such file or directory
   75 | #include <sys/audioio.h>
      |          ^~~~~~~~~~~~~~~
compilation terminated.
configure:19595: $? = 1
configure: failed program was:
| /* confdefs.h */
| #define PACKAGE_NAME "jack-audio-connection-kit"
| #define PACKAGE_TARNAME "jack-audio-connection-kit"
| #define PACKAGE_VERSION "0.126.0"
| #define PACKAGE_STRING "jack-audio-connection-kit 0.126.0"
| #define PACKAGE_BUGREPORT "jack-devel@lists.jackaudio.org"
| #define PACKAGE_URL "http://www.jackaudio.org/"
| #define PROTOCOL_VERSION "25"
| #define PACKAGE "jack-audio-connection-kit"
| #define VERSION "0.126.0"
| #define HAVE_STDIO_H 1
| #define HAVE_STDLIB_H 1
| #define HAVE_STRING_H 1
| #define HAVE_INTTYPES_H 1
| #define HAVE_STDINT_H 1
| #define HAVE_STRINGS_H 1
| #define HAVE_SYS_STAT_H 1
| #define HAVE_SYS_TYPES_H 1
| #define HAVE_UNISTD_H 1
| #define STDC_HEADERS 1
| #define HAVE_DLFCN_H 1
| #define LT_OBJDIR ".libs/"
| #define USE_MD5SUM "1"
| #define JACK_THREAD_STACK_TOUCH 500000
| #define HAVE_STRING_H 1
| #define HAVE_STRINGS_H 1
| #define HAVE_DB_H 1
| #define HAVE_GETOPT_H 1
| #define HAVE_ON_EXIT 1
| #define HAVE_ATEXIT 1
| #define HAVE_POSIX_MEMALIGN 1
| #define HAVE_LIBM 1
| #define HAVE_LIBDB 1
| #define HAVE_PPOLL 1
| #define HAVE_CLOCK_GETTIME 1
| #define HAVE_CLOCK_NANOSLEEP 1
| #define USE_MLOCK 1
| #define JACK_SHM_TYPE "System V"
| #define DO_BUFFER_RESIZE /**/
| #define OLD_TRANSPORT /**/
| #define ADDON_DIR "/usr/lib/jack"
| #define DEFAULT_TMP_DIR "/dev/shm"
| #define USE_BARRIER 1
| #define HAVE_SAMPLERATE 1
| #define HAVE_CELT 0
| /* end confdefs.h.  */
| #include <stddef.h>
| #ifdef HAVE_STDIO_H
| # include <stdio.h>
| #endif
| #ifdef HAVE_STDLIB_H
| # include <stdlib.h>
| #endif
| #ifdef HAVE_STRING_H
| # include <string.h>
| #endif
| #ifdef HAVE_INTTYPES_H
| # include <inttypes.h>
| #endif
| #ifdef HAVE_STDINT_H
| # include <stdint.h>
| #endif
| #ifdef HAVE_STRINGS_H
| # include <strings.h>
| #endif
| #ifdef HAVE_SYS_TYPES_H
| # include <sys/types.h>
| #endif
| #ifdef HAVE_SYS_STAT_H
| # include <sys/stat.h>
| #endif
| #ifdef HAVE_UNISTD_H
| # include <unistd.h>
| #endif
| #include <sys/audioio.h>
configure:19595: result: no
configure:19624: checking for sndio.h
configure:19624: gcc -c  -I$(top_srcdir)/config -I$(top_srcdir) -I$(top_srcdir)/include -I$(top_builddir)/include -D_REENTRANT -D_POSIX_PTHREAD_SEMANTICS -Wall  -g  conftest.c >&5
conftest.c:75:10: fatal error: sndio.h: No such file or directory
   75 | #include <sndio.h>
      |          ^~~~~~~~~
compilation terminated.
configure:19624: $? = 1
configure: failed program was:
| /* confdefs.h */
| #define PACKAGE_NAME "jack-audio-connection-kit"
| #define PACKAGE_TARNAME "jack-audio-connection-kit"
| #define PACKAGE_VERSION "0.126.0"
| #define PACKAGE_STRING "jack-audio-connection-kit 0.126.0"
| #define PACKAGE_BUGREPORT "jack-devel@lists.jackaudio.org"
| #define PACKAGE_URL "http://www.jackaudio.org/"
| #define PROTOCOL_VERSION "25"
| #define PACKAGE "jack-audio-connection-kit"
| #define VERSION "0.126.0"
| #define HAVE_STDIO_H 1
| #define HAVE_STDLIB_H 1
| #define HAVE_STRING_H 1
| #define HAVE_INTTYPES_H 1
| #define HAVE_STDINT_H 1
| #define HAVE_STRINGS_H 1
| #define HAVE_SYS_STAT_H 1
| #define HAVE_SYS_TYPES_H 1
| #define HAVE_UNISTD_H 1
| #define STDC_HEADERS 1
| #define HAVE_DLFCN_H 1
| #define LT_OBJDIR ".libs/"
| #define USE_MD5SUM "1"
| #define JACK_THREAD_STACK_TOUCH 500000
| #define HAVE_STRING_H 1
| #define HAVE_STRINGS_H 1
| #define HAVE_DB_H 1
| #define HAVE_GETOPT_H 1
| #define HAVE_ON_EXIT 1
| #define HAVE_ATEXIT 1
| #define HAVE_POSIX_MEMALIGN 1
| #define HAVE_LIBM 1
| #define HAVE_LIBDB 1
| #define HAVE_PPOLL 1
| #define HAVE_CLOCK_GETTIME 1
| #define HAVE_CLOCK_NANOSLEEP 1
| #define USE_MLOCK 1
| #define JACK_SHM_TYPE "System V"
| #define DO_BUFFER_RESIZE /**/
| #define OLD_TRANSPORT /**/
| #define ADDON_DIR "/usr/lib/jack"
| #define DEFAULT_TMP_DIR "/dev/shm"
| #define USE_BARRIER 1
| #define HAVE_SAMPLERATE 1
| #define HAVE_CELT 0
| /* end confdefs.h.  */
| #include <stddef.h>
| #ifdef HAVE_STDIO_H
| # include <stdio.h>
| #endif
| #ifdef HAVE_STDLIB_H
| # include <stdlib.h>
| #endif
| #ifdef HAVE_STRING_H
| # include <string.h>
| #endif
| #ifdef HAVE_INTTYPES_H
| # include <inttypes.h>
| #endif
| #ifdef HAVE_STDINT_H
| # include <stdint.h>
| #endif
| #ifdef HAVE_STRINGS_H
| # include <strings.h>
| #endif
| #ifdef HAVE_SYS_TYPES_H
| # include <sys/types.h>
| #endif
| #ifdef HAVE_SYS_STAT_H
| # include <sys/stat.h>
| #endif
| #ifdef HAVE_UNISTD_H
| # include <unistd.h>
| #endif
| #include <sndio.h>
configure:19624: result: no
configure:19657: checking for libfreebob >= 1.0.0
configure:19664: $PKG_CONFIG --exists --print-errors "libfreebob >= 1.0.0"
Package libfreebob was not found in the pkg-config search path.
Perhaps you should add the directory containing `libfreebob.pc'
to the PKG_CONFIG_PATH environment variable
Package 'libfreebob', required by 'virtual:world', not found
configure:19667: $? = 1
configure:19681: $PKG_CONFIG --exists --print-errors "libfreebob >= 1.0.0"
Package libfreebob was not found in the pkg-config search path.
Perhaps you should add the directory containing `libfreebob.pc'
to the PKG_CONFIG_PATH environment variable
Package 'libfreebob', required by 'virtual:world', not found
configure:19684: $? = 1
configure:19698: result: no
Package 'libfreebob', required by 'virtual:world', not found
configure:19714: result: no
configure:19758: checking for libffado >= 1.999.17
configure:19765: $PKG_CONFIG --exists --print-errors "libffado >= 1.999.17"
Package libffado was not found in the pkg-config search path.
Perhaps you should add the directory containing `libffado.pc'
to the PKG_CONFIG_PATH environment variable
Package 'libffado', required by 'virtual:world', not found
configure:19768: $? = 1
configure:19782: $PKG_CONFIG --exists --print-errors "libffado >= 1.999.17"
Package libffado was not found in the pkg-config search path.
Perhaps you should add the directory containing `libffado.pc'
to the PKG_CONFIG_PATH environment variable
Package 'libffado', required by 'virtual:world', not found
configure:19785: $? = 1
configure:19799: result: no
Package 'libffado', required by 'virtual:world', not found
configure:19815: result: no
configure:19859: checking for alsa >= 1.0.18
configure:19866: $PKG_CONFIG --exists --print-errors "alsa >= 1.0.18"
configure:19869: $? = 0
configure:19883: $PKG_CONFIG --exists --print-errors "alsa >= 1.0.18"
configure:19886: $? = 0
configure:19926: result: yes
configure:19971: checking for doxygen
configure:20004: result: false
configure:20013: WARNING: *** doxygen not found, docs will not be built
configure:20168: checking that generated files are newer than configure
configure:20174: result: done
configure:20270: creating ./config.status

## ---------------------- ##
## Running config.status. ##
## ---------------------- ##

This file was extended by jack-audio-connection-kit config.status 0.126.0, which was
generated by GNU Autoconf 2.71.  Invocation command line was

  CONFIG_FILES    = 
  CONFIG_HEADERS  = 
  CONFIG_LINKS    = 
  CONFIG_COMMANDS = 
  $ ./config.status 

on pine64so

config.status:1271: creating Makefile
config.status:1271: creating config/Makefile
config.status:1271: creating config/os/Makefile
config.status:1271: creating config/os/generic/Makefile
config.status:1271: creating config/os/gnu-linux/Makefile
config.status:1271: creating config/os/macosx/Makefile
config.status:1271: creating config/sysdeps/Makefile
config.status:1271: creating doc/Makefile
config.status:1271: creating doc/reference.doxygen
config.status:1271: creating drivers/Makefile
config.status:1271: creating drivers/alsa/Makefile
config.status:1271: creating drivers/alsa_midi/Makefile
config.status:1271: creating drivers/dummy/Makefile
config.status:1271: creating drivers/oss/Makefile
config.status:1271: creating drivers/sun/Makefile
config.status:1271: creating drivers/sndio/Makefile
config.status:1271: creating drivers/portaudio/Makefile
config.status:1271: creating drivers/coreaudio/Makefile
config.status:1271: creating drivers/freebob/Makefile
config.status:1271: creating drivers/firewire/Makefile
config.status:1271: creating drivers/netjack/Makefile
config.status:1271: creating man/Makefile
config.status:1271: creating jack.pc
config.status:1271: creating jack.spec
config.status:1271: creating jackd/Makefile
config.status:1271: creating jackd/jackd.1
config.status:1271: creating include/version.h
config.status:1271: creating include/Makefile
config.status:1271: creating libjack/Makefile
config.status:1271: creating python/Makefile
config.status:1271: creating config.h
config.status:1452: config.h is unchanged
config.status:1500: executing depfiles commands
config.status:1577: cd drivers/alsa       && sed -e '/# am--include-marker/d' Makefile         | make -f - am--depfiles
make: Nothing to be done for 'am--depfiles'.
config.status:1582: $? = 0
config.status:1577: cd drivers/alsa_midi       && sed -e '/# am--include-marker/d' Makefile         | make -f - am--depfiles
make: Nothing to be done for 'am--depfiles'.
config.status:1582: $? = 0
config.status:1577: cd drivers/dummy       && sed -e '/# am--include-marker/d' Makefile         | make -f - am--depfiles
make: Nothing to be done for 'am--depfiles'.
config.status:1582: $? = 0
config.status:1577: cd drivers/oss       && sed -e '/# am--include-marker/d' Makefile         | make -f - am--depfiles
make: Nothing to be done for 'am--depfiles'.
config.status:1582: $? = 0
config.status:1577: cd drivers/sun       && sed -e '/# am--include-marker/d' Makefile         | make -f - am--depfiles
make: Nothing to be done for 'am--depfiles'.
config.status:1582: $? = 0
config.status:1577: cd drivers/sndio       && sed -e '/# am--include-marker/d' Makefile         | make -f - am--depfiles
make: Nothing to be done for 'am--depfiles'.
config.status:1582: $? = 0
config.status:1577: cd drivers/portaudio       && sed -e '/# am--include-marker/d' Makefile         | make -f - am--depfiles
make: Nothing to be done for 'am--depfiles'.
config.status:1582: $? = 0
config.status:1577: cd drivers/coreaudio       && sed -e '/# am--include-marker/d' Makefile         | make -f - am--depfiles
make: Nothing to be done for 'am--depfiles'.
config.status:1582: $? = 0
config.status:1577: cd drivers/freebob       && sed -e '/# am--include-marker/d' Makefile         | make -f - am--depfiles
make: Nothing to be done for 'am--depfiles'.
config.status:1582: $? = 0
config.status:1577: cd drivers/firewire       && sed -e '/# am--include-marker/d' Makefile         | make -f - am--depfiles
make: Nothing to be done for 'am--depfiles'.
config.status:1582: $? = 0
config.status:1577: cd drivers/netjack       && sed -e '/# am--include-marker/d' Makefile         | make -f - am--depfiles
make: Nothing to be done for 'am--depfiles'.
config.status:1582: $? = 0
config.status:1577: cd jackd       && sed -e '/# am--include-marker/d' Makefile         | make -f - am--depfiles
make: Nothing to be done for 'am--depfiles'.
config.status:1582: $? = 0
config.status:1577: cd libjack       && sed -e '/# am--include-marker/d' Makefile         | make -f - am--depfiles
make: Nothing to be done for 'am--depfiles'.
config.status:1582: $? = 0
config.status:1500: executing libtool commands

## ---------------- ##
## Cache variables. ##
## ---------------- ##

ac_cv_build=aarch64-unknown-linux-gnu
ac_cv_c_bigendian=no
ac_cv_c_compiler_gnu=yes
ac_cv_cxx_compiler_gnu=yes
ac_cv_env_ALSA_CFLAGS_set=
ac_cv_env_ALSA_CFLAGS_value=
ac_cv_env_ALSA_LIBS_set=
ac_cv_env_ALSA_LIBS_value=
ac_cv_env_CCC_set=
ac_cv_env_CCC_value=
ac_cv_env_CC_set=
ac_cv_env_CC_value=
ac_cv_env_CELT_CFLAGS_set=
ac_cv_env_CELT_CFLAGS_value=
ac_cv_env_CELT_LIBS_set=
ac_cv_env_CELT_LIBS_value=
ac_cv_env_CFLAGS_set=
ac_cv_env_CFLAGS_value=
ac_cv_env_CPPFLAGS_set=
ac_cv_env_CPPFLAGS_value=
ac_cv_env_CPP_set=
ac_cv_env_CPP_value=
ac_cv_env_CXXCPP_set=
ac_cv_env_CXXCPP_value=
ac_cv_env_CXXFLAGS_set=
ac_cv_env_CXXFLAGS_value=
ac_cv_env_CXX_set=
ac_cv_env_CXX_value=
ac_cv_env_LDFLAGS_set=
ac_cv_env_LDFLAGS_value=
ac_cv_env_LIBFFADO_CFLAGS_set=
ac_cv_env_LIBFFADO_CFLAGS_value=
ac_cv_env_LIBFFADO_LIBS_set=
ac_cv_env_LIBFFADO_LIBS_value=
ac_cv_env_LIBFREEBOB_CFLAGS_set=
ac_cv_env_LIBFREEBOB_CFLAGS_value=
ac_cv_env_LIBFREEBOB_LIBS_set=
ac_cv_env_LIBFREEBOB_LIBS_value=
ac_cv_env_LIBS_set=
ac_cv_env_LIBS_value=
ac_cv_env_LT_SYS_LIBRARY_PATH_set=
ac_cv_env_LT_SYS_LIBRARY_PATH_value=
ac_cv_env_PKG_CONFIG_LIBDIR_set=
ac_cv_env_PKG_CONFIG_LIBDIR_value=
ac_cv_env_PKG_CONFIG_PATH_set=
ac_cv_env_PKG_CONFIG_PATH_value=
ac_cv_env_PKG_CONFIG_set=
ac_cv_env_PKG_CONFIG_value=
ac_cv_env_SAMPLERATE_CFLAGS_set=
ac_cv_env_SAMPLERATE_CFLAGS_value=
ac_cv_env_SAMPLERATE_LIBS_set=
ac_cv_env_SAMPLERATE_LIBS_value=
ac_cv_env_build_alias_set=
ac_cv_env_build_alias_value=
ac_cv_env_host_alias_set=
ac_cv_env_host_alias_value=
ac_cv_env_target_alias_set=
ac_cv_env_target_alias_value=
ac_cv_func_atexit=yes
ac_cv_func_clock_gettime=yes
ac_cv_func_clock_nanosleep=yes
ac_cv_func_connect=yes
ac_cv_func_dlopen=yes
ac_cv_func_gethostent=yes
ac_cv_func_getopt_long=yes
ac_cv_func_mlockall=yes
ac_cv_func_on_exit=yes
ac_cv_func_posix_memalign=yes
ac_cv_func_pthread_create=yes
ac_cv_func_setsockopt=yes
ac_cv_header_CoreAudio_CoreAudio_h=no
ac_cv_header__usr_include_nptl_pthread_h=no
ac_cv_header_db_h=yes
ac_cv_header_dlfcn_h=yes
ac_cv_header_getopt_h=yes
ac_cv_header_inttypes_h=yes
ac_cv_header_sndio_h=no
ac_cv_header_stdint_h=yes
ac_cv_header_stdio_h=yes
ac_cv_header_stdlib_h=yes
ac_cv_header_string_h=yes
ac_cv_header_strings_h=yes
ac_cv_header_sys_audioio_h=no
ac_cv_header_sys_mman_h=yes
ac_cv_header_sys_soundcard_h=yes
ac_cv_header_sys_stat_h=yes
ac_cv_header_sys_types_h=yes
ac_cv_header_unistd_h=yes
ac_cv_host=aarch64-unknown-linux-gnu
ac_cv_lib_db_db_create=yes
ac_cv_lib_m_sin=yes
ac_cv_lib_pthread_pthread_barrier_init=yes
ac_cv_objext=o
ac_cv_path_EGREP='/usr/bin/grep -E'
ac_cv_path_FGREP='/usr/bin/grep -F'
ac_cv_path_GREP=/usr/bin/grep
ac_cv_path_SED=/usr/bin/sed
ac_cv_path_ac_pt_PKG_CONFIG=/usr/bin/pkg-config
ac_cv_path_install='/usr/bin/install -c'
ac_cv_path_lt_DD=/usr/bin/dd
ac_cv_path_mkdir=/usr/bin/mkdir
ac_cv_prog_AWK=mawk
ac_cv_prog_CPP='gcc -E'
ac_cv_prog_CXXCPP='g++ -E'
ac_cv_prog_HAVE_DOXYGEN=false
ac_cv_prog_ac_ct_AR=ar
ac_cv_prog_ac_ct_CC=gcc
ac_cv_prog_ac_ct_CXX=g++
ac_cv_prog_ac_ct_FILECMD=file
ac_cv_prog_ac_ct_MANIFEST_TOOL=mt
ac_cv_prog_ac_ct_OBJDUMP=objdump
ac_cv_prog_ac_ct_RANLIB=ranlib
ac_cv_prog_ac_ct_STRIP=strip
ac_cv_prog_cc_c11=
ac_cv_prog_cc_g=yes
ac_cv_prog_cc_stdc=
ac_cv_prog_cxx_cxx11=
ac_cv_prog_cxx_g=yes
ac_cv_prog_cxx_stdcxx=
ac_cv_prog_make_make_set=yes
am_cv_CC_dependencies_compiler_type=gcc3
am_cv_CXX_dependencies_compiler_type=gcc3
am_cv_make_support_nested_variables=yes
am_cv_prog_cc_c_o=yes
lt_cv_ar_at_file=@
lt_cv_archive_cmds_need_lc=no
lt_cv_deplibs_check_method=pass_all
lt_cv_file_magic_cmd='$MAGIC_CMD'
lt_cv_file_magic_test_file=
lt_cv_ld_reload_flag=-r
lt_cv_nm_interface='BSD nm'
lt_cv_objdir=.libs
lt_cv_path_LD=/usr/bin/ld
lt_cv_path_LDCXX=/usr/bin/ld
lt_cv_path_NM='/usr/bin/nm -B'
lt_cv_path_mainfest_tool=no
lt_cv_prog_compiler_c_o=yes
lt_cv_prog_compiler_c_o_CXX=yes
lt_cv_prog_compiler_pic='-fPIC -DPIC'
lt_cv_prog_compiler_pic_CXX='-fPIC -DPIC'
lt_cv_prog_compiler_pic_works=yes
lt_cv_prog_compiler_pic_works_CXX=yes
lt_cv_prog_compiler_rtti_exceptions=no
lt_cv_prog_compiler_static_works=yes
lt_cv_prog_compiler_static_works_CXX=yes
lt_cv_prog_gnu_ld=yes
lt_cv_prog_gnu_ldcxx=yes
lt_cv_sharedlib_from_linklib_cmd='printf %s\n'
lt_cv_shlibpath_overrides_runpath=yes
lt_cv_sys_global_symbol_pipe='/usr/bin/sed -n -e '\''s/^.*[	 ]\([ABCDGIRSTW][ABCDGIRSTW]*\)[	 ][	 ]*\([_A-Za-z][_A-Za-z0-9]*\)$/\1 \2 \2/p'\'' | /usr/bin/sed '\''/ __gnu_lto/d'\'''
lt_cv_sys_global_symbol_to_c_name_address='/usr/bin/sed -n -e '\''s/^: \(.*\) .*$/  {"\1", (void *) 0},/p'\'' -e '\''s/^[ABCDGIRSTW][ABCDGIRSTW]* .* \(.*\)$/  {"\1", (void *) \&\1},/p'\'''
lt_cv_sys_global_symbol_to_c_name_address_lib_prefix='/usr/bin/sed -n -e '\''s/^: \(.*\) .*$/  {"\1", (void *) 0},/p'\'' -e '\''s/^[ABCDGIRSTW][ABCDGIRSTW]* .* \(lib.*\)$/  {"\1", (void *) \&\1},/p'\'' -e '\''s/^[ABCDGIRSTW][ABCDGIRSTW]* .* \(.*\)$/  {"lib\1", (void *) \&\1},/p'\'''
lt_cv_sys_global_symbol_to_cdecl='/usr/bin/sed -n -e '\''s/^T .* \(.*\)$/extern int \1();/p'\'' -e '\''s/^[ABCDGIRSTW][ABCDGIRSTW]* .* \(.*\)$/extern char \1;/p'\'''
lt_cv_sys_global_symbol_to_import=
lt_cv_sys_max_cmd_len=1572864
lt_cv_to_host_file_cmd=func_convert_file_noop
lt_cv_to_tool_file_cmd=func_convert_file_noop
lt_cv_truncate_bin='/usr/bin/dd bs=4096 count=1'
pkg_cv_ALSA_CFLAGS=
pkg_cv_ALSA_LIBS='-lasound '
pkg_cv_SAMPLERATE_CFLAGS=
pkg_cv_SAMPLERATE_LIBS='-lsamplerate '

## ----------------- ##
## Output variables. ##
## ----------------- ##

ACLOCAL='${SHELL} '\''/git_repos/jack1/config/missing'\'' aclocal-1.16'
ADDON_DIR='${libdir}/jack'
ALSA_CFLAGS=''
ALSA_LIBS='-lasound'
AMDEPBACKSLASH='\'
AMDEP_FALSE='#'
AMDEP_TRUE=''
AMTAR='$${TAR-tar}'
AM_BACKSLASH='\'
AM_DEFAULT_V='$(AM_DEFAULT_VERBOSITY)'
AM_DEFAULT_VERBOSITY='0'
AM_V='$(V)'
AR='ar'
AUTOCONF='${SHELL} '\''/git_repos/jack1/config/missing'\'' autoconf'
AUTOHEADER='${SHELL} '\''/git_repos/jack1/config/missing'\'' autoheader'
AUTOMAKE='${SHELL} '\''/git_repos/jack1/config/missing'\'' automake-1.16'
AWK='mawk'
CC='gcc'
CCDEPMODE='depmode=gcc3'
CELT_CFLAGS=''
CELT_LIBS=''
CFLAGS=' -I$(top_srcdir)/config -I$(top_srcdir) -I$(top_srcdir)/include -I$(top_builddir)/include -D_REENTRANT -D_POSIX_PTHREAD_SEMANTICS -Wall  -g'
CPP='gcc -E'
CPPFLAGS=''
CSCOPE='cscope'
CTAGS='ctags'
CXX='g++'
CXXCPP='g++ -E'
CXXDEPMODE='depmode=gcc3'
CXXFLAGS='-g -O2'
CYGPATH_W='echo'
DEFAULT_TMP_DIR='/dev/shm'
DEFS='-DHAVE_CONFIG_H'
DEPDIR='.deps'
DLLTOOL='false'
DSYMUTIL=''
DUMPBIN=''
ECHO_C=''
ECHO_N='-n'
ECHO_T=''
EGREP='/usr/bin/grep -E'
ETAGS='etags'
EXEEXT=''
FGREP='/usr/bin/grep -F'
FILECMD='file'
GREP='/usr/bin/grep'
HAVE_ALSA_FALSE='#'
HAVE_ALSA_MIDI_FALSE='#'
HAVE_ALSA_MIDI_TRUE=''
HAVE_ALSA_TRUE=''
HAVE_CAPABILITIES=''
HAVE_CELT_FALSE=''
HAVE_CELT_TRUE='#'
HAVE_COREAUDIO_FALSE=''
HAVE_COREAUDIO_TRUE='#'
HAVE_DOXYGEN='false'
HAVE_DOXYGEN_FALSE=''
HAVE_DOXYGEN_TRUE='#'
HAVE_FIREWIRE_FALSE=''
HAVE_FIREWIRE_TRUE='#'
HAVE_FREEBOB_FALSE=''
HAVE_FREEBOB_TRUE='#'
HAVE_OSS_FALSE='#'
HAVE_OSS_TRUE=''
HAVE_PA_FALSE=''
HAVE_PA_TRUE='#'
HAVE_PPOLL_FALSE='#'
HAVE_PPOLL_TRUE=''
HAVE_SAMPLERATE_FALSE='#'
HAVE_SAMPLERATE_TRUE=''
HAVE_SNDIO_FALSE=''
HAVE_SNDIO_TRUE='#'
HAVE_SUN_FALSE=''
HAVE_SUN_TRUE='#'
HTML_DIR='${pkgdatadir}'
INSTALL_DATA='${INSTALL} -m 644'
INSTALL_PROGRAM='${INSTALL}'
INSTALL_SCRIPT='${INSTALL}'
INSTALL_STRIP_PROGRAM='$(install_sh) -c -s'
JACK_API_MAJOR_VERSION=''
JACK_API_MICRO_VERSION=''
JACK_API_MINOR_VERSION=''
JACK_CFLAGS='-I$(top_srcdir)/config -I$(top_srcdir) -I$(top_srcdir)/include -I$(top_builddir)/include -D_REENTRANT -D_POSIX_PTHREAD_SEMANTICS -Wall  -g'
JACK_CORE_CFLAGS='-I$(top_srcdir)/config -I$(top_srcdir) -I$(top_srcdir)/include -I$(top_builddir)/include -D_REENTRANT -D_POSIX_PTHREAD_SEMANTICS -Wall '
JACK_PROTOCOL_VERSION='25'
JACK_RELEASE='0-126-0'
JACK_SEMAPHORE_KEY='0x282929'
JACK_SO_VERSION='0:28:0'
JACK_VERSION='0.126.0'
LD='/usr/bin/ld'
LDFLAGS=''
LIBFFADO_CFLAGS=''
LIBFFADO_LIBS=''
LIBFREEBOB_CFLAGS=''
LIBFREEBOB_LIBS=''
LIBOBJS=''
LIBS='-ldb -lm '
LIBTOOL='$(SHELL) $(top_builddir)/libtool'
LIPO=''
LN_S='ln -s'
LTLIBOBJS=''
LT_SYS_LIBRARY_PATH=''
MAKEINFO='${SHELL} '\''/git_repos/jack1/config/missing'\'' makeinfo'
MANIFEST_TOOL=':'
MKDIR_P='/usr/bin/mkdir -p'
NETJACK_CFLAGS=' '
NETJACK_LIBS=' -lsamplerate '
NM='/usr/bin/nm -B'
NMEDIT=''
OBJDUMP='objdump'
OBJEXT='o'
OS_LDFLAGS=''
OTOOL64=''
OTOOL=''
PACKAGE='jack-audio-connection-kit'
PACKAGE_BUGREPORT='jack-devel@lists.jackaudio.org'
PACKAGE_NAME='jack-audio-connection-kit'
PACKAGE_STRING='jack-audio-connection-kit 0.126.0'
PACKAGE_TARNAME='jack-audio-connection-kit'
PACKAGE_URL='http://www.jackaudio.org/'
PACKAGE_VERSION='0.126.0'
PATH_SEPARATOR=':'
PA_LIBS=''
PKG_CONFIG='/usr/bin/pkg-config'
PKG_CONFIG_LIBDIR=''
PKG_CONFIG_PATH=''
RANLIB='ranlib'
SAMPLERATE_CFLAGS=''
SAMPLERATE_LIBS='-lsamplerate '
SED='/usr/bin/sed'
SET_MAKE=''
SHELL='/bin/bash'
SIMD_CFLAGS=''
SNDIO_LIBS='-lsndio'
STRIP='strip'
STRIPPED_JACKD_FALSE=''
STRIPPED_JACKD_TRUE='#'
USE_CAPABILITIES_FALSE=''
USE_CAPABILITIES_TRUE='#'
USE_MD5SUM='1'
USE_MD5SUM_FALSE='#'
USE_MD5SUM_TRUE=''
USE_POSIX_SHM_FALSE=''
USE_POSIX_SHM_TRUE='#'
VERSION='0.126.0'
ac_ct_AR='ar'
ac_ct_CC='gcc'
ac_ct_CXX='g++'
ac_ct_DUMPBIN=''
am__EXEEXT_FALSE=''
am__EXEEXT_TRUE='#'
am__fastdepCC_FALSE='#'
am__fastdepCC_TRUE=''
am__fastdepCXX_FALSE='#'
am__fastdepCXX_TRUE=''
am__include='include'
am__isrc=''
am__leading_dot='.'
am__nodep='_no'
am__quote=''
am__tar='$${TAR-tar} chof - "$$tardir"'
am__untar='$${TAR-tar} xf -'
bindir='${exec_prefix}/bin'
build='aarch64-unknown-linux-gnu'
build_alias=''
build_cpu='aarch64'
build_os='linux-gnu'
build_vendor='unknown'
datadir='${datarootdir}'
datarootdir='${prefix}/share'
docdir='${datarootdir}/doc/${PACKAGE_TARNAME}'
dvidir='${docdir}'
exec_prefix='${prefix}'
host='aarch64-unknown-linux-gnu'
host_alias=''
host_cpu='aarch64'
host_os='linux-gnu'
host_vendor='unknown'
htmldir='${docdir}'
includedir='${prefix}/include'
infodir='${datarootdir}/info'
install_sh='${SHELL} /git_repos/jack1/config/install-sh'
libdir='${exec_prefix}/lib'
libexecdir='${exec_prefix}/libexec'
localedir='${datarootdir}/locale'
localstatedir='${prefix}/var'
mandir='${datarootdir}/man'
mkdir_p='$(MKDIR_P)'
oldincludedir='/usr/include'
pdfdir='${docdir}'
prefix='/usr'
program_transform_name='s,x,x,'
psdir='${docdir}'
runstatedir='${localstatedir}/run'
sbindir='${exec_prefix}/sbin'
sharedstatedir='${prefix}/com'
sysconfdir='${prefix}/etc'
target_alias=''

## ----------- ##
## confdefs.h. ##
## ----------- ##

/* confdefs.h */
#define PACKAGE_NAME "jack-audio-connection-kit"
#define PACKAGE_TARNAME "jack-audio-connection-kit"
#define PACKAGE_VERSION "0.126.0"
#define PACKAGE_STRING "jack-audio-connection-kit 0.126.0"
#define PACKAGE_BUGREPORT "jack-devel@lists.jackaudio.org"
#define PACKAGE_URL "http://www.jackaudio.org/"
#define PROTOCOL_VERSION "25"
#define PACKAGE "jack-audio-connection-kit"
#define VERSION "0.126.0"
#define HAVE_STDIO_H 1
#define HAVE_STDLIB_H 1
#define HAVE_STRING_H 1
#define HAVE_INTTYPES_H 1
#define HAVE_STDINT_H 1
#define HAVE_STRINGS_H 1
#define HAVE_SYS_STAT_H 1
#define HAVE_SYS_TYPES_H 1
#define HAVE_UNISTD_H 1
#define STDC_HEADERS 1
#define HAVE_DLFCN_H 1
#define LT_OBJDIR ".libs/"
#define USE_MD5SUM "1"
#define JACK_THREAD_STACK_TOUCH 500000
#define HAVE_STRING_H 1
#define HAVE_STRINGS_H 1
#define HAVE_DB_H 1
#define HAVE_GETOPT_H 1
#define HAVE_ON_EXIT 1
#define HAVE_ATEXIT 1
#define HAVE_POSIX_MEMALIGN 1
#define HAVE_LIBM 1
#define HAVE_LIBDB 1
#define HAVE_PPOLL 1
#define HAVE_CLOCK_GETTIME 1
#define HAVE_CLOCK_NANOSLEEP 1
#define USE_MLOCK 1
#define JACK_SHM_TYPE "System V"
#define DO_BUFFER_RESIZE /**/
#define OLD_TRANSPORT /**/
#define ADDON_DIR "/usr/lib/jack"
#define DEFAULT_TMP_DIR "/dev/shm"
#define USE_BARRIER 1
#define HAVE_SAMPLERATE 1
#define HAVE_CELT 0
#define JACK_DEFAULT_DRIVER "alsa"
#define JACK_SEMAPHORE_KEY 0x282929

configure: exit 0
