This file contains any messages produced by compilers while
running configure, to aid debugging if configure makes a mistake.

It was created by configure, which was
generated by GNU Autoconf 2.71.  Invocation command line was

  $ ./configure --prefix=/usr --without-gui

## --------- ##
## Platform. ##
## --------- ##

hostname = pine64so
uname -m = aarch64
uname -r = 5.4.2-rt5-001
uname -s = Linux
uname -v = #108 SMP PREEMPT_RT Wed Oct 11 12:20:26 AEDT 2023

/usr/bin/uname -p = unknown
/bin/uname -X     = unknown

/bin/arch              = aarch64
/usr/bin/arch -k       = unknown
/usr/convex/getsysinfo = unknown
/usr/bin/hostinfo      = unknown
/bin/machine           = unknown
/usr/bin/oslevel       = unknown
/bin/universe          = unknown

PATH: /usr/local/bin/
PATH: /usr/bin/
PATH: /bin/
PATH: /usr/local/games/
PATH: /usr/games/


## ----------- ##
## Core tests. ##
## ----------- ##

configure:2733: looking for aux files: compile missing install-sh config.guess config.sub
configure:2746:  trying ././
configure:2775:   ././compile found
configure:2775:   ././missing found
configure:2757:   ././install-sh found
configure:2775:   ././config.guess found
configure:2775:   ././config.sub found
configure:2895: checking build system type
configure:2910: result: aarch64-unknown-linux-gnu
configure:2930: checking host system type
configure:2944: result: aarch64-unknown-linux-gnu
configure:2964: checking target system type
configure:2978: result: aarch64-unknown-linux-gnu
configure:3041: checking for a BSD-compatible install
configure:3114: result: /usr/bin/install -c
configure:3125: checking whether build environment is sane
configure:3180: result: yes
configure:3215: WARNING: 'missing' script is too old or missing
configure:3339: checking for a race-free mkdir -p
configure:3383: result: /usr/bin/mkdir -p
configure:3390: checking for gawk
configure:3425: result: no
configure:3390: checking for mawk
configure:3411: found /usr/bin/mawk
configure:3422: result: mawk
configure:3433: checking whether make sets $(MAKE)
configure:3456: result: yes
configure:3486: checking whether make supports nested variables
configure:3504: result: yes
configure:3707: checking for gcc
configure:3728: found /usr/bin/gcc
configure:3739: result: gcc
configure:4092: checking for C compiler version
configure:4101: gcc --version >&5
gcc (Debian 12.2.0-14) 12.2.0
Copyright (C) 2022 Free Software Foundation, Inc.
This is free software; see the source for copying conditions.  There is NO
warranty; not even for MERCHANTABILITY or FITNESS FOR A PARTICULAR PURPOSE.

configure:4112: $? = 0
configure:4101: gcc -v >&5
Using built-in specs.
COLLECT_GCC=gcc
COLLECT_LTO_WRAPPER=/usr/lib/gcc/aarch64-linux-gnu/12/lto-wrapper
Target: aarch64-linux-gnu
Configured with: ../src/configure -v --with-pkgversion='Debian 12.2.0-14' --with-bugurl=file:///usr/share/doc/gcc-12/README.Bugs --enable-languages=c,ada,c++,go,d,fortran,objc,obj-c++,m2 --prefix=/usr --with-gcc-major-version-only --program-suffix=-12 --program-prefix=aarch64-linux-gnu- --enable-shared --enable-linker-build-id --libexecdir=/usr/lib --without-included-gettext --enable-threads=posix --libdir=/usr/lib --enable-nls --enable-clocale=gnu --enable-libstdcxx-debug --enable-libstdcxx-time=yes --with-default-libstdcxx-abi=new --enable-gnu-unique-object --disable-libquadmath --disable-libquadmath-support --enable-plugin --enable-default-pie --with-system-zlib --enable-libphobos-checking=release --with-target-system-zlib=auto --enable-objc-gc=auto --enable-multiarch --enable-fix-cortex-a53-843419 --disable-werror --enable-checking=release --build=aarch64-linux-gnu --host=aarch64-linux-gnu --target=aarch64-linux-gnu
Thread model: posix
Supported LTO compression algorithms: zlib zstd
gcc version 12.2.0 (Debian 12.2.0-14) 
configure:4112: $? = 0
configure:4101: gcc -V >&5
gcc: error: unrecognized command-line option '-V'
gcc: fatal error: no input files
compilation terminated.
configure:4112: $? = 1
configure:4101: gcc -qversion >&5
gcc: error: unrecognized command-line option '-qversion'; did you mean '--version'?
gcc: fatal error: no input files
compilation terminated.
configure:4112: $? = 1
configure:4101: gcc -version >&5
gcc: error: unrecognized command-line option '-version'
gcc: fatal error: no input files
compilation terminated.
configure:4112: $? = 1
configure:4132: checking whether the C compiler works
configure:4154: gcc    conftest.c  >&5
configure:4158: $? = 0
configure:4208: result: yes
configure:4211: checking for C compiler default output file name
configure:4213: result: a.out
configure:4219: checking for suffix of executables
configure:4226: gcc -o conftest    conftest.c  >&5
configure:4230: $? = 0
configure:4253: result: 
configure:4275: checking whether we are cross compiling
configure:4283: gcc -o conftest    conftest.c  >&5
configure:4287: $? = 0
configure:4294: ./conftest
configure:4298: $? = 0
configure:4313: result: no
configure:4318: checking for suffix of object files
configure:4341: gcc -c   conftest.c >&5
configure:4345: $? = 0
configure:4367: result: o
configure:4371: checking whether the compiler supports GNU C
configure:4391: gcc -c   conftest.c >&5
configure:4391: $? = 0
configure:4401: result: yes
configure:4412: checking whether gcc accepts -g
configure:4433: gcc -c -g  conftest.c >&5
configure:4433: $? = 0
configure:4477: result: yes
configure:4497: checking for gcc option to enable C11 features
configure:4512: gcc  -c -g -O2  conftest.c >&5
configure:4512: $? = 0
configure:4530: result: none needed
configure:4646: checking whether gcc understands -c and -o together
configure:4669: gcc -c conftest.c -o conftest2.o
configure:4672: $? = 0
configure:4669: gcc -c conftest.c -o conftest2.o
configure:4672: $? = 0
configure:4684: result: yes
configure:4704: checking whether make supports the include directive
configure:4719: make -f confmf.GNU && cat confinc.out
this is the am__doit target
configure:4722: $? = 0
configure:4741: result: yes (GNU style)
configure:4767: checking dependency style of gcc
configure:4879: result: gcc3
configure:4963: checking for g++
configure:4984: found /usr/bin/g++
configure:4995: result: g++
configure:5022: checking for C++ compiler version
configure:5031: g++ --version >&5
g++ (Debian 12.2.0-14) 12.2.0
Copyright (C) 2022 Free Software Foundation, Inc.
This is free software; see the source for copying conditions.  There is NO
warranty; not even for MERCHANTABILITY or FITNESS FOR A PARTICULAR PURPOSE.

configure:5042: $? = 0
configure:5031: g++ -v >&5
Using built-in specs.
COLLECT_GCC=g++
COLLECT_LTO_WRAPPER=/usr/lib/gcc/aarch64-linux-gnu/12/lto-wrapper
Target: aarch64-linux-gnu
Configured with: ../src/configure -v --with-pkgversion='Debian 12.2.0-14' --with-bugurl=file:///usr/share/doc/gcc-12/README.Bugs --enable-languages=c,ada,c++,go,d,fortran,objc,obj-c++,m2 --prefix=/usr --with-gcc-major-version-only --program-suffix=-12 --program-prefix=aarch64-linux-gnu- --enable-shared --enable-linker-build-id --libexecdir=/usr/lib --without-included-gettext --enable-threads=posix --libdir=/usr/lib --enable-nls --enable-clocale=gnu --enable-libstdcxx-debug --enable-libstdcxx-time=yes --with-default-libstdcxx-abi=new --enable-gnu-unique-object --disable-libquadmath --disable-libquadmath-support --enable-plugin --enable-default-pie --with-system-zlib --enable-libphobos-checking=release --with-target-system-zlib=auto --enable-objc-gc=auto --enable-multiarch --enable-fix-cortex-a53-843419 --disable-werror --enable-checking=release --build=aarch64-linux-gnu --host=aarch64-linux-gnu --target=aarch64-linux-gnu
Thread model: posix
Supported LTO compression algorithms: zlib zstd
gcc version 12.2.0 (Debian 12.2.0-14) 
configure:5042: $? = 0
configure:5031: g++ -V >&5
g++: error: unrecognized command-line option '-V'
g++: fatal error: no input files
compilation terminated.
configure:5042: $? = 1
configure:5031: g++ -qversion >&5
g++: error: unrecognized command-line option '-qversion'; did you mean '--version'?
g++: fatal error: no input files
compilation terminated.
configure:5042: $? = 1
configure:5046: checking whether the compiler supports GNU C++
configure:5066: g++ -c   conftest.cpp >&5
configure:5066: $? = 0
configure:5076: result: yes
configure:5087: checking whether g++ accepts -g
configure:5108: g++ -c -g  conftest.cpp >&5
configure:5108: $? = 0
configure:5152: result: yes
configure:5172: checking for g++ option to enable C++11 features
configure:5187: g++  -c -g -O2  conftest.cpp >&5
conftest.cpp: In function 'int main(int, char**)':
conftest.cpp:177:25: warning: empty parentheses were disambiguated as a function declaration [-Wvexing-parse]
  177 |   cxx11test::delegate d2();
      |                         ^~
conftest.cpp:177:25: note: remove parentheses to default-initialize a variable
  177 |   cxx11test::delegate d2();
      |                         ^~
      |                         --
conftest.cpp:177:25: note: or replace parentheses with braces to value-initialize a variable
configure:5187: $? = 0
configure:5205: result: none needed
configure:5271: checking dependency style of g++
configure:5383: result: gcc3
configure:5408: checking for stdio.h
configure:5408: gcc -c -g -O2  conftest.c >&5
configure:5408: $? = 0
configure:5408: result: yes
configure:5408: checking for stdlib.h
configure:5408: gcc -c -g -O2  conftest.c >&5
configure:5408: $? = 0
configure:5408: result: yes
configure:5408: checking for string.h
configure:5408: gcc -c -g -O2  conftest.c >&5
configure:5408: $? = 0
configure:5408: result: yes
configure:5408: checking for inttypes.h
configure:5408: gcc -c -g -O2  conftest.c >&5
configure:5408: $? = 0
configure:5408: result: yes
configure:5408: checking for stdint.h
configure:5408: gcc -c -g -O2  conftest.c >&5
configure:5408: $? = 0
configure:5408: result: yes
configure:5408: checking for strings.h
configure:5408: gcc -c -g -O2  conftest.c >&5
configure:5408: $? = 0
configure:5408: result: yes
configure:5408: checking for sys/stat.h
configure:5408: gcc -c -g -O2  conftest.c >&5
configure:5408: $? = 0
configure:5408: result: yes
configure:5408: checking for sys/types.h
configure:5408: gcc -c -g -O2  conftest.c >&5
configure:5408: $? = 0
configure:5408: result: yes
configure:5408: checking for unistd.h
configure:5408: gcc -c -g -O2  conftest.c >&5
configure:5408: $? = 0
configure:5408: result: yes
configure:5433: checking whether byte ordering is bigendian
configure:5449: gcc -c -g -O2  conftest.c >&5
conftest.c:22:16: error: unknown type name 'not'
   22 |                not a universal capable compiler
      |                ^~~
conftest.c:22:22: error: expected '=', ',', ';', 'asm' or '__attribute__' before 'universal'
   22 |                not a universal capable compiler
      |                      ^~~~~~~~~
conftest.c:22:22: error: unknown type name 'universal'
configure:5449: $? = 1
configure: failed program was:
| /* confdefs.h */
| #define PACKAGE_NAME ""
| #define PACKAGE_TARNAME ""
| #define PACKAGE_VERSION ""
| #define PACKAGE_STRING ""
| #define PACKAGE_BUGREPORT ""
| #define PACKAGE_URL ""
| #define PACKAGE "sooperlooper"
| #define VERSION "1.7.6"
| #define HAVE_STDIO_H 1
| #define HAVE_STDLIB_H 1
| #define HAVE_STRING_H 1
| #define HAVE_INTTYPES_H 1
| #define HAVE_STDINT_H 1
| #define HAVE_STRINGS_H 1
| #define HAVE_SYS_STAT_H 1
| #define HAVE_SYS_TYPES_H 1
| #define HAVE_UNISTD_H 1
| #define STDC_HEADERS 1
| /* end confdefs.h.  */
| #ifndef __APPLE_CC__
| 	       not a universal capable compiler
| 	     #endif
| 	     typedef int dummy;
| 
configure:5495: gcc -c -g -O2  conftest.c >&5
configure:5495: $? = 0
configure:5514: gcc -c -g -O2  conftest.c >&5
conftest.c: In function 'main':
conftest.c:28:18: error: unknown type name 'not'; did you mean 'ino_t'?
   28 |                  not big endian
      |                  ^~~
      |                  ino_t
conftest.c:28:26: error: expected '=', ',', ';', 'asm' or '__attribute__' before 'endian'
   28 |                  not big endian
      |                          ^~~~~~
configure:5514: $? = 1
configure: failed program was:
| /* confdefs.h */
| #define PACKAGE_NAME ""
| #define PACKAGE_TARNAME ""
| #define PACKAGE_VERSION ""
| #define PACKAGE_STRING ""
| #define PACKAGE_BUGREPORT ""
| #define PACKAGE_URL ""
| #define PACKAGE "sooperlooper"
| #define VERSION "1.7.6"
| #define HAVE_STDIO_H 1
| #define HAVE_STDLIB_H 1
| #define HAVE_STRING_H 1
| #define HAVE_INTTYPES_H 1
| #define HAVE_STDINT_H 1
| #define HAVE_STRINGS_H 1
| #define HAVE_SYS_STAT_H 1
| #define HAVE_SYS_TYPES_H 1
| #define HAVE_UNISTD_H 1
| #define STDC_HEADERS 1
| /* end confdefs.h.  */
| #include <sys/types.h>
| 		#include <sys/param.h>
| 
| int
| main (void)
| {
| #if BYTE_ORDER != BIG_ENDIAN
| 		 not big endian
| 		#endif
| 
|   ;
|   return 0;
| }
configure:5648: result: no
configure:5690: checking whether g++ supports C++11 features with -std=c++11
configure:5989: g++ -std=c++11 -c -g -O2  conftest.cpp >&5
configure:5989: $? = 0
configure:5999: result: yes
configure:6135: result: OPT_CXXFLAGS is set based on  -pipe -Wall -D_LARGEFILE_SOURCE -D_LARGEFILE64_SOURCE
configure:6187: checking for ranlib
configure:6208: found /usr/bin/ranlib
configure:6219: result: ranlib
configure:6249: checking for --with-macosx-sdk
configure:6273: result: 
configure:6276: checking for --with-macosx-version-min
configure:6301: result: yes
configure:6518: checking for pkg-config
configure:6541: found /usr/bin/pkg-config
configure:6553: result: /usr/bin/pkg-config
configure:6578: checking pkg-config is at least version 0.9.0
configure:6581: result: yes
configure:6591: checking for jack >= 0.80.0
configure:6598: $PKG_CONFIG --exists --print-errors "jack >= 0.80.0"
configure:6601: $? = 0
configure:6615: $PKG_CONFIG --exists --print-errors "jack >= 0.80.0"
configure:6618: $? = 0
configure:6656: result: yes
configure:6664: checking for jack_client_open in -ljack
configure:6686: g++ -std=c++11 -o conftest -g -O2   conftest.cpp -ljack -ljack   >&5
configure:6686: $? = 0
configure:6696: result: yes
configure:6712: checking for liblo >= 0.10
configure:6719: $PKG_CONFIG --exists --print-errors "liblo >= 0.10"
configure:6722: $? = 0
configure:6736: $PKG_CONFIG --exists --print-errors "liblo >= 0.10"
configure:6739: $? = 0
configure:6797: result: yes
configure:6805: checking for initscr in -lncurses
configure:6827: g++ -std=c++11 -o conftest -g -O2   conftest.cpp -lncurses   >&5
/usr/bin/ld: cannot find -lncurses: No such file or directory
collect2: error: ld returned 1 exit status
configure:6827: $? = 1
configure: failed program was:
| /* confdefs.h */
| #define PACKAGE_NAME ""
| #define PACKAGE_TARNAME ""
| #define PACKAGE_VERSION ""
| #define PACKAGE_STRING ""
| #define PACKAGE_BUGREPORT ""
| #define PACKAGE_URL ""
| #define PACKAGE "sooperlooper"
| #define VERSION "1.7.6"
| #define HAVE_STDIO_H 1
| #define HAVE_STDLIB_H 1
| #define HAVE_STRING_H 1
| #define HAVE_INTTYPES_H 1
| #define HAVE_STDINT_H 1
| #define HAVE_STRINGS_H 1
| #define HAVE_SYS_STAT_H 1
| #define HAVE_SYS_TYPES_H 1
| #define HAVE_UNISTD_H 1
| #define STDC_HEADERS 1
| #define HAVE_CXX11 1
| #define HAVE_JACK_CLIENT_OPEN 1
| /* end confdefs.h.  */
| 
| namespace conftest {
|   extern "C" int initscr ();
| }
| int
| main (void)
| {
| return conftest::initscr ();
|   ;
|   return 0;
| }
configure:6837: result: no
configure:6843: WARNING: ******** you don't have the ncurses library correctly installed
configure:6848: checking for nodelay in -ltinfo
configure:6870: g++ -std=c++11 -o conftest -g -O2   conftest.cpp -ltinfo   >&5
/usr/bin/ld: cannot find -ltinfo: No such file or directory
collect2: error: ld returned 1 exit status
configure:6870: $? = 1
configure: failed program was:
| /* confdefs.h */
| #define PACKAGE_NAME ""
| #define PACKAGE_TARNAME ""
| #define PACKAGE_VERSION ""
| #define PACKAGE_STRING ""
| #define PACKAGE_BUGREPORT ""
| #define PACKAGE_URL ""
| #define PACKAGE "sooperlooper"
| #define VERSION "1.7.6"
| #define HAVE_STDIO_H 1
| #define HAVE_STDLIB_H 1
| #define HAVE_STRING_H 1
| #define HAVE_INTTYPES_H 1
| #define HAVE_STDINT_H 1
| #define HAVE_STRINGS_H 1
| #define HAVE_SYS_STAT_H 1
| #define HAVE_SYS_TYPES_H 1
| #define HAVE_UNISTD_H 1
| #define STDC_HEADERS 1
| #define HAVE_CXX11 1
| #define HAVE_JACK_CLIENT_OPEN 1
| /* end confdefs.h.  */
| 
| namespace conftest {
|   extern "C" int nodelay ();
| }
| int
| main (void)
| {
| return conftest::nodelay ();
|   ;
|   return 0;
| }
configure:6880: result: no
configure:6886: WARNING: ncurses doesnt need ltinfo
configure:6894: checking for sigc++-2.0 >= 2.2.10
configure:6901: $PKG_CONFIG --exists --print-errors "sigc++-2.0 >= 2.2.10"
configure:6904: $? = 0
configure:6918: $PKG_CONFIG --exists --print-errors "sigc++-2.0 >= 2.2.10"
configure:6921: $? = 0
configure:6979: result: yes
configure:6992: checking for libxml-2.0 >= 2.5
configure:6999: $PKG_CONFIG --exists --print-errors "libxml-2.0 >= 2.5"
configure:7002: $? = 0
configure:7016: $PKG_CONFIG --exists --print-errors "libxml-2.0 >= 2.5"
configure:7019: $? = 0
configure:7077: result: yes
configure:7086: checking for sndfile >= 1.0.2
configure:7093: $PKG_CONFIG --exists --print-errors "sndfile >= 1.0.2"
configure:7096: $? = 0
configure:7110: $PKG_CONFIG --exists --print-errors "sndfile >= 1.0.2"
configure:7113: $? = 0
configure:7151: result: yes
configure:7163: checking for samplerate >= 0.0.13
configure:7170: $PKG_CONFIG --exists --print-errors "samplerate >= 0.0.13"
configure:7173: $? = 0
configure:7187: $PKG_CONFIG --exists --print-errors "samplerate >= 0.0.13"
configure:7190: $? = 0
configure:7228: result: yes
configure:7240: checking for rubberband >= 0.0.13
configure:7247: $PKG_CONFIG --exists --print-errors "rubberband >= 0.0.13"
Package rubberband was not found in the pkg-config search path.
Perhaps you should add the directory containing `rubberband.pc'
to the PKG_CONFIG_PATH environment variable
Package 'rubberband', required by 'virtual:world', not found
configure:7250: $? = 1
configure:7264: $PKG_CONFIG --exists --print-errors "rubberband >= 0.0.13"
Package rubberband was not found in the pkg-config search path.
Perhaps you should add the directory containing `rubberband.pc'
to the PKG_CONFIG_PATH environment variable
Package 'rubberband', required by 'virtual:world', not found
configure:7267: $? = 1
configure:7281: result: no
Package 'rubberband', required by 'virtual:world', not found
configure:7317: checking for fftw3 >= 3.0
configure:7324: $PKG_CONFIG --exists --print-errors "fftw3 >= 3.0"
configure:7327: $? = 0
configure:7341: $PKG_CONFIG --exists --print-errors "fftw3 >= 3.0"
configure:7344: $? = 0
configure:7382: result: yes
configure:7696: checking for alsa/asoundlib.h
configure:7696: g++ -std=c++11 -c -g -O2  conftest.cpp >&5
configure:7696: $? = 0
configure:7696: result: yes
configure:7717: checking for /System/Library/Frameworks/CoreMIDI.framework/CoreMIDI
configure:7731: result: no
configure:7937: checking that generated files are newer than configure
configure:7943: result: done
configure:7979: creating ./config.status

## ---------------------- ##
## Running config.status. ##
## ---------------------- ##

This file was extended by config.status, which was
generated by GNU Autoconf 2.71.  Invocation command line was

  CONFIG_FILES    = 
  CONFIG_HEADERS  = 
  CONFIG_LINKS    = 
  CONFIG_COMMANDS = 
  $ ./config.status 

on pine64so

config.status:922: creating Makefile
config.status:922: creating src/Makefile
config.status:922: creating src/gui/Makefile
config.status:922: creating version.h
config.status:922: creating config.h
config.status:1151: executing depfiles commands
config.status:1228: cd src       && sed -e '/# am--include-marker/d' Makefile         | make -f - am--depfiles
make: Nothing to be done for 'am--depfiles'.
config.status:1233: $? = 0
config.status:1228: cd src/gui       && sed -e '/# am--include-marker/d' Makefile         | make -f - am--depfiles
make: Nothing to be done for 'am--depfiles'.
config.status:1233: $? = 0
configure:9362: === configuring in libs (/git_repos/sooperlooper/libs)
configure:9423: running /bin/bash ./configure --disable-option-checking '--prefix=/usr'  '--without-gui' --cache-file=/dev/null --srcdir=.

## ---------------- ##
## Cache variables. ##
## ---------------- ##

ac_cv_build=aarch64-unknown-linux-gnu
ac_cv_c_bigendian=no
ac_cv_c_compiler_gnu=yes
ac_cv_cxx_compiler_gnu=yes
ac_cv_env_CCC_set=
ac_cv_env_CCC_value=
ac_cv_env_CC_set=
ac_cv_env_CC_value=
ac_cv_env_CFLAGS_set=
ac_cv_env_CFLAGS_value=
ac_cv_env_CPPFLAGS_set=
ac_cv_env_CPPFLAGS_value=
ac_cv_env_CXXFLAGS_set=
ac_cv_env_CXXFLAGS_value=
ac_cv_env_CXX_set=
ac_cv_env_CXX_value=
ac_cv_env_FFTW_CFLAGS_set=
ac_cv_env_FFTW_CFLAGS_value=
ac_cv_env_FFTW_LIBS_set=
ac_cv_env_FFTW_LIBS_value=
ac_cv_env_JACK_CFLAGS_set=
ac_cv_env_JACK_CFLAGS_value=
ac_cv_env_JACK_LIBS_set=
ac_cv_env_JACK_LIBS_value=
ac_cv_env_LDFLAGS_set=
ac_cv_env_LDFLAGS_value=
ac_cv_env_LIBS_set=
ac_cv_env_LIBS_value=
ac_cv_env_LOSC_CFLAGS_set=
ac_cv_env_LOSC_CFLAGS_value=
ac_cv_env_LOSC_LIBS_set=
ac_cv_env_LOSC_LIBS_value=
ac_cv_env_PKG_CONFIG_LIBDIR_set=
ac_cv_env_PKG_CONFIG_LIBDIR_value=
ac_cv_env_PKG_CONFIG_PATH_set=
ac_cv_env_PKG_CONFIG_PATH_value=
ac_cv_env_PKG_CONFIG_set=
ac_cv_env_PKG_CONFIG_value=
ac_cv_env_RUBBERBAND_CFLAGS_set=
ac_cv_env_RUBBERBAND_CFLAGS_value=
ac_cv_env_RUBBERBAND_LIBS_set=
ac_cv_env_RUBBERBAND_LIBS_value=
ac_cv_env_SAMPLERATE_CFLAGS_set=
ac_cv_env_SAMPLERATE_CFLAGS_value=
ac_cv_env_SAMPLERATE_LIBS_set=
ac_cv_env_SAMPLERATE_LIBS_value=
ac_cv_env_SIGCPP_CFLAGS_set=
ac_cv_env_SIGCPP_CFLAGS_value=
ac_cv_env_SIGCPP_LIBS_set=
ac_cv_env_SIGCPP_LIBS_value=
ac_cv_env_SNDFILE_CFLAGS_set=
ac_cv_env_SNDFILE_CFLAGS_value=
ac_cv_env_SNDFILE_LIBS_set=
ac_cv_env_SNDFILE_LIBS_value=
ac_cv_env_XML_CFLAGS_set=
ac_cv_env_XML_CFLAGS_value=
ac_cv_env_XML_LIBS_set=
ac_cv_env_XML_LIBS_value=
ac_cv_env_build_alias_set=
ac_cv_env_build_alias_value=
ac_cv_env_host_alias_set=
ac_cv_env_host_alias_value=
ac_cv_env_target_alias_set=
ac_cv_env_target_alias_value=
ac_cv_file__System_Library_Frameworks_CoreMIDI_framework_CoreMIDI=no
ac_cv_header_alsa_asoundlib_h=yes
ac_cv_header_inttypes_h=yes
ac_cv_header_stdint_h=yes
ac_cv_header_stdio_h=yes
ac_cv_header_stdlib_h=yes
ac_cv_header_string_h=yes
ac_cv_header_strings_h=yes
ac_cv_header_sys_stat_h=yes
ac_cv_header_sys_types_h=yes
ac_cv_header_unistd_h=yes
ac_cv_host=aarch64-unknown-linux-gnu
ac_cv_lib_jack_jack_client_open=yes
ac_cv_lib_ncurses_initscr=no
ac_cv_lib_tinfo_nodelay=no
ac_cv_objext=o
ac_cv_path_ac_pt_PKG_CONFIG=/usr/bin/pkg-config
ac_cv_path_install='/usr/bin/install -c'
ac_cv_path_mkdir=/usr/bin/mkdir
ac_cv_prog_AWK=mawk
ac_cv_prog_ac_ct_CC=gcc
ac_cv_prog_ac_ct_CXX=g++
ac_cv_prog_ac_ct_RANLIB=ranlib
ac_cv_prog_cc_c11=
ac_cv_prog_cc_g=yes
ac_cv_prog_cc_stdc=
ac_cv_prog_cxx_cxx11=
ac_cv_prog_cxx_g=yes
ac_cv_prog_cxx_stdcxx=
ac_cv_prog_make_make_set=yes
ac_cv_rubberband=0
ac_cv_samplerate=1
ac_cv_sndfile=1
ac_cv_target=aarch64-unknown-linux-gnu
am_cv_CC_dependencies_compiler_type=gcc3
am_cv_CXX_dependencies_compiler_type=gcc3
am_cv_make_support_nested_variables=yes
am_cv_prog_cc_c_o=yes
ax_cv_cxx_compile_cxx11__std_cpp11=yes
pkg_cv_FFTW_CFLAGS=
pkg_cv_FFTW_LIBS='-lfftw3 '
pkg_cv_JACK_CFLAGS=
pkg_cv_JACK_LIBS='-ljack '
pkg_cv_LOSC_CFLAGS=
pkg_cv_LOSC_LIBS='-llo -lpthread '
pkg_cv_SAMPLERATE_CFLAGS=
pkg_cv_SAMPLERATE_LIBS='-lsamplerate '
pkg_cv_SIGCPP_CFLAGS='-I/usr/include/sigc++-2.0 -I/usr/lib/aarch64-linux-gnu/sigc++-2.0/include '
pkg_cv_SIGCPP_LIBS='-lsigc-2.0 '
pkg_cv_SNDFILE_CFLAGS='-I/usr/include/opus -I/usr/include/aarch64-linux-gnu '
pkg_cv_SNDFILE_LIBS='-lsndfile '
pkg_cv_XML_CFLAGS='-I/usr/include/libxml2 '
pkg_cv_XML_LIBS='-lxml2 '

## ----------------- ##
## Output variables. ##
## ----------------- ##

ACLOCAL='aclocal-1.16'
ACLOCAL_AMFLAGS='-I /git_repos/sooperlooper/aclocal -I m4'
ACLOCAL_FLAGS='-I /git_repos/sooperlooper/aclocal -I /git_repos/sooperlooper/m4'
AMDEPBACKSLASH='\'
AMDEP_FALSE='#'
AMDEP_TRUE=''
AMTAR='$${TAR-tar}'
AM_BACKSLASH='\'
AM_DEFAULT_V='$(AM_DEFAULT_VERBOSITY)'
AM_DEFAULT_VERBOSITY='1'
AM_V='$(V)'
AUDIO_LIBS='-lasound'
AUTOCONF='autoconf'
AUTOHEADER='autoheader'
AUTOMAKE='automake-1.16'
AWK='mawk'
BASE_INCLUDES='-I/git_repos/sooperlooper/libs/pbd -I/git_repos/sooperlooper/libs/midi++'
BASE_LIBS='/git_repos/sooperlooper/libs/midi++/libmidipp.a /git_repos/sooperlooper/libs/pbd/libpbd.a'
CC='gcc'
CCDEPMODE='depmode=gcc3'
CFLAGS='-g -O2  -pipe -Wall -D_LARGEFILE_SOURCE -D_LARGEFILE64_SOURCE  -I/git_repos/sooperlooper/libs/pbd -I/git_repos/sooperlooper/libs/midi++'
CPPFLAGS=''
CSCOPE='cscope'
CTAGS='ctags'
CXX='g++ -std=c++11'
CXXDEPMODE='depmode=gcc3'
CXXFLAGS='-g -O2  -pipe -Wall -D_LARGEFILE_SOURCE -D_LARGEFILE64_SOURCE -I/git_repos/sooperlooper/libs/pbd -I/git_repos/sooperlooper/libs/midi++'
CYGPATH_W='echo'
DEFS='-DHAVE_CONFIG_H'
DEPDIR='.deps'
ECHO_C=''
ECHO_N='-n'
ECHO_T=''
ETAGS='etags'
EXEEXT=''
FFTW_CFLAGS=''
FFTW_LIBS='-lfftw3 '
HAVE_CXX11='1'
ICU_CFLAGS=''
ICU_LIBS=''
INSTALL_DATA='${INSTALL} -m 644'
INSTALL_PROGRAM='${INSTALL}'
INSTALL_SCRIPT='${INSTALL}'
INSTALL_STRIP_PROGRAM='$(install_sh) -c -s'
JACK_CFLAGS=''
JACK_LIBS='-ljack '
LDFLAGS=''
LIBOBJS=''
LIBS=''
LOSC_CFLAGS=''
LOSC_LIBS='-llo -lpthread '
LTLIBOBJS=''
MAKEINFO='makeinfo'
MKDIR_P='/usr/bin/mkdir -p'
NCURSES_LIBS='-lncurses'
OBJEXT='o'
PACKAGE='sooperlooper'
PACKAGE_BUGREPORT=''
PACKAGE_NAME=''
PACKAGE_STRING=''
PACKAGE_TARNAME=''
PACKAGE_URL=''
PACKAGE_VERSION=''
PATH_SEPARATOR=':'
PKG_CONFIG='/usr/bin/pkg-config'
PKG_CONFIG_LIBDIR=''
PKG_CONFIG_PATH=''
RANLIB='ranlib'
RUBBERBAND_CFLAGS=''
RUBBERBAND_LIBS=''
SAMPLERATE_CFLAGS=''
SAMPLERATE_LIBS='-lsamplerate '
SET_MAKE=''
SHELL='/bin/bash'
SIGCPP_CFLAGS='-I/usr/include/sigc++-2.0 -I/usr/lib/aarch64-linux-gnu/sigc++-2.0/include '
SIGCPP_LIBS='-lsigc-2.0 '
SL_DIRS='.'
SNDFILE_CFLAGS='-I/usr/include/opus -I/usr/include/aarch64-linux-gnu '
SNDFILE_LIBS='-lsndfile '
SOOP_MAJOR_VERSION='1'
SOOP_MICRO_VERSION='6'
SOOP_MINOR_VERSION='7'
SOOP_RELEASE='1-7-6'
SOOP_SO_VERSION='1:7:6'
SOOP_VERSION='1.7.6'
STRIP=''
VERSION='1.7.6'
WITH_ALSA_FALSE='#'
WITH_ALSA_TRUE=''
WITH_COREMIDI_FALSE=''
WITH_COREMIDI_TRUE='#'
WX_CFLAGS=''
WX_CONFIG0=''
WX_CONFIG1=''
WX_CONFIG2=''
WX_CONFIG3=''
WX_CONFIG4=''
WX_CONFIG=''
WX_LIBS=''
XML_CFLAGS='-I/usr/include/libxml2 '
XML_LIBS='-lxml2 '
ac_ct_CC='gcc'
ac_ct_CXX='g++'
am__EXEEXT_FALSE=''
am__EXEEXT_TRUE='#'
am__fastdepCC_FALSE='#'
am__fastdepCC_TRUE=''
am__fastdepCXX_FALSE='#'
am__fastdepCXX_TRUE=''
am__include='include'
am__isrc=''
am__leading_dot='.'
am__nodep='_no'
am__quote=''
am__tar='$${TAR-tar} chof - "$$tardir"'
am__untar='$${TAR-tar} xf -'
bindir='${exec_prefix}/bin'
build='aarch64-unknown-linux-gnu'
build_alias=''
build_cpu='aarch64'
build_os='linux-gnu'
build_vendor='unknown'
datadir='${datarootdir}'
datarootdir='${prefix}/share'
docdir='${datarootdir}/doc/${PACKAGE}'
dvidir='${docdir}'
exec_prefix='${prefix}'
host='aarch64-unknown-linux-gnu'
host_alias=''
host_cpu='aarch64'
host_os='linux-gnu'
host_vendor='unknown'
htmldir='${docdir}'
includedir='${prefix}/include'
infodir='${datarootdir}/info'
install_sh='${SHELL} /git_repos/sooperlooper/install-sh'
libdir='${exec_prefix}/lib'
libexecdir='${exec_prefix}/libexec'
localedir='${datarootdir}/locale'
localstatedir='${prefix}/var'
mandir='${datarootdir}/man'
mkdir_p='$(MKDIR_P)'
oldincludedir='/usr/include'
pdfdir='${docdir}'
prefix='/usr'
program_transform_name='s,x,x,'
psdir='${docdir}'
runstatedir='${localstatedir}/run'
sbindir='${exec_prefix}/sbin'
sharedstatedir='${prefix}/com'
subdirs=' libs'
sysconfdir='${prefix}/etc'
target='aarch64-unknown-linux-gnu'
target_alias=''
target_cpu='aarch64'
target_os='linux-gnu'
target_vendor='unknown'

## ----------- ##
## confdefs.h. ##
## ----------- ##

/* confdefs.h */
#define PACKAGE_NAME ""
#define PACKAGE_TARNAME ""
#define PACKAGE_VERSION ""
#define PACKAGE_STRING ""
#define PACKAGE_BUGREPORT ""
#define PACKAGE_URL ""
#define PACKAGE "sooperlooper"
#define VERSION "1.7.6"
#define HAVE_STDIO_H 1
#define HAVE_STDLIB_H 1
#define HAVE_STRING_H 1
#define HAVE_INTTYPES_H 1
#define HAVE_STDINT_H 1
#define HAVE_STRINGS_H 1
#define HAVE_SYS_STAT_H 1
#define HAVE_SYS_TYPES_H 1
#define HAVE_UNISTD_H 1
#define STDC_HEADERS 1
#define HAVE_CXX11 1
#define HAVE_JACK_CLIENT_OPEN 1
#define HAVE_SNDFILE 1
#define HAVE_SAMPLERATE 1
#define HAVE_RUBBERBAND 0
#define WITH_ALSA 1

configure: exit 0
